program: Gaussian 16
title: Me-anthracene (2 pos) radical - 15 as ts
version: ES64L-G16RevC.01
method: UM062X
basis: 6-311++G(d,p)
operation: Freq
keyword: #P
keyword: Geom=AllCheck
keyword: Guess=TCheck
keyword: SCRF=Check
keyword: GenChk
keyword: UM062X/6-311++G(d,p)
keyword: Freq
converged: YES YES YES YES
polarizability: 3.67143561e+02 8.01671565e+01 2.41440256e+02 -5.31006634e+00 -1.91105942e+01 1.41115629e+02
1716.lowfreq: -631.3727 -4.6379 -0.0008 -0.0005 0.0003 7.4029 15.2117 57.1752 88.6403
frequency: -631.3727 57.1744 88.6277 117.1417 142.4392 165.7198 236.8718 250.6793 273.2962 382.4984 395.4845 396.8667 460.5347 480.7146 502.0537 524.9897 532.1711 562.7497 580.5511 614.4573 632.9255 661.9177 731.9667 762.0126 768.8421 771.8960 799.6959 826.2807 837.9076 866.8472 875.1839 912.1731 913.6489 920.4981 923.5637 982.4050 998.8180 1003.4592 1014.6651 1019.7773 1038.2731 1123.5624 1147.8068 1165.4939 1180.8224 1189.9859 1206.7138 1287.6883 1289.7787 1298.4966 1342.9314 1370.7647 1409.2224 1418.2066 1418.7782 1440.0682 1443.4487 1474.6324 1492.0432 1521.4800 1572.6172 1621.2637 1646.8350 1671.9823 1697.2356 3101.7334 3184.9866 3187.0859 3192.9951 3193.1682 3196.1720 3196.8187 3208.0659 3212.0499 3218.3237 3224.1310 3266.1786 3273.5482
redmass: 9.9976 3.8022 3.6817 4.2795 1.0521 3.1651 4.3753 4.5860 3.5882 3.4263 5.3956 4.4317 2.5402 2.6009 3.1755 2.9768 1.2830 1.5013 3.0922 4.7470 6.4535 5.2578 3.2531 1.2311 3.3298 5.5787 1.3860 3.0359 1.4914 1.2580 1.3625 3.9615 1.6414 1.9971 2.6182 1.4661 1.3574 1.4849 1.2870 1.5135 2.3062 1.9141 1.4726 1.3364 1.1486 1.2027 1.2265 2.2485 1.8763 1.6256 3.2431 2.9039 1.6079 1.0940 1.0947 4.2483 5.8055 2.0819 3.1314 2.9428 5.0597 6.7108 5.8730 6.4019 6.2085 1.0125 1.0908 1.0909 1.0866 1.0873 1.0888 1.0887 1.0936 1.0944 1.0973 1.0979 1.1156 1.1164
irintensity: 38.0214 0.7757 0.1230 1.3534 0.1043 0.7828 1.8716 0.7279 0.2029 0.2636 0.0405 0.2511 9.7931 20.8961 0.5183 1.1255 3.0003 7.0828 2.6637 8.5455 0.5960 0.7239 0.7167 106.0471 0.0300 0.0906 13.2194 1.7163 1.6979 2.4727 2.1906 12.1826 29.8276 41.2151 23.1893 0.3194 3.4486 3.7856 0.0012 0.5127 6.6381 0.2269 1.6642 8.6296 2.5179 0.5452 3.5713 0.7448 3.4125 0.7824 6.5653 5.9664 0.8453 6.4796 2.9258 3.9980 23.5694 3.0658 5.6573 0.0474 3.5267 7.2578 0.4556 19.3503 2.7997 8.2120 12.8752 0.8918 2.4159 6.3515 2.4279 0.1084 19.0861 19.7633 13.5879 18.9699 4.5317 4.9733
temp: 403.150 k
press: 1.00000 atm
elementType: 6 6 6 6 6 6 6 6 6 6 6 1 6 6 6 1 1 1 1 1 1 1 1 1 6 1 1 1
symmnumber: 1
zpe: 598820.1 jmol-1
zpe.correction: 0.228079 hartree
zpe.thermalcorrener: 0.249897 hartree
zpe.thermalcorrenthalpy: 0.251173 hartree
zpe.thermalcorrgfe: 0.169752 hartree
zpe.sumelectzpe: -579.010587 hartree
zpe.sumelectthermal: -578.988769 hartree
zpe.sumelectthermalent: -578.987492 hartree
zpe.sumelectthermalfe: -579.068914 hartree
dipole: -0.8781 -0.3114 0.1498
dipole: 0.9436
quadrupole: -63.7453 -78.8894 -96.6896
quadrupole: 3.1994 3.0404 -3.4170
quadrupole: 16.0294 0.8854 -16.9148 3.1994 3.0404 -3.4170
hfenergy: -579.2386654 hartree
pointgroup: C01 [X(C15H13)]
dipole: -0.3454616 -0.1225075 0.0589309 debye
polarizability: 367.1435607|80.1671565|241.4402555|-5.3100663|-19.1105942|141.115629 unknown
InChI: InChI=1/C14H10.CH3/c1-2-6-12-10-14-8-4-3-7-13(14)9-11(12)5-1;/h1-10H;1H3
charge 0 multiplicity 2
28 atoms
C  -9.34037559 -1.55458836 -0.3113503
C  -8.01166263 -1.52336978 -0.05795637
C  -7.27429957 -0.28683789 -0.10539318
C  -7.96918387 0.91386436 -0.4902382
C  -9.35960805 0.83964066 -0.78754963
C  -10.06925331 -0.33695066 -0.59553163
C  -5.91822862 -0.22955653 0.1843047
C  -7.25415235 2.11105455 -0.57332663
C  -5.88701628 2.16995818 -0.28046914
C  -5.20144505 0.97444414 0.109981
C  -3.80810771 1.04560233 0.40768439
H  -3.29439465 0.13672297 0.70248708
C  -3.13437706 2.22972566 0.32409701
C  -3.81519715 3.41963279 -0.06392971
C  -5.14725427 3.39028143 -0.35642547
H  -5.39691764 -1.13750452 0.47296309
H  -9.88546324 -2.49064259 -0.26864096
H  -7.4722451 -2.43386161 0.18065566
H  -11.07646723 -0.41758781 -0.98618739
H  -7.77223293 3.01886388 -0.86756608
H  -2.07613253 2.27222616 0.55255976
H  -3.26494971 4.35107267 -0.12543736
H  -5.66878568 4.29435415 -0.652133
H  -9.87233026 1.74040477 -1.1070621
C  -10.97815797 -0.07826048 1.41879156
H  -11.58590753 0.80531297 1.26825749
H  -11.50533779 -1.01687613 1.54209066
H  -10.06505525 0.04649567 1.98696776
