program: Gaussian 16
title: Anthracene 1-CH abs by methyl radical
version: ES64L-G16RevC.01
method: UM062X
basis: 6-311++G(d,p)
operation: Freq
keyword: #P
keyword: Geom=AllCheck
keyword: Guess=TCheck
keyword: SCRF=Check
keyword: GenChk
keyword: UM062X/6-311++G(d,p)
keyword: Freq
converged: YES YES YES YES
polarizability: 3.14331536e+02 5.07005743e+01 2.81496945e+02 6.02647945e-01 -4.21523421e-01 1.09766867e+02
1716.lowfreq: -1457.8887 -11.6350 -6.9449 -0.0003 0.0001 0.0004 7.3927 47.9153 56.3186
frequency: -1457.8887 47.8306 56.2975 61.7384 88.7562 129.0456 231.5745 238.2400 265.1680 339.1111 382.3721 395.4425 418.0399 444.6456 478.5785 494.5148 520.0542 536.7587 542.6348 581.5823 621.5565 654.8112 669.4239 737.4529 759.5870 767.7746 784.2320 791.3873 842.4258 863.0108 902.4152 913.3919 919.7237 922.4326 927.9052 999.0582 1004.8596 1014.6443 1030.1981 1042.7423 1133.2043 1148.6938 1177.4421 1184.6090 1190.7215 1193.5590 1243.8824 1260.3877 1291.5979 1294.5764 1331.4569 1347.7283 1358.4979 1398.4184 1431.4209 1444.9954 1450.3061 1462.6349 1472.3280 1493.7292 1515.1224 1589.1385 1623.2290 1651.0760 1697.4759 1705.7028 3085.6625 3189.3980 3193.2360 3197.2303 3198.1539 3200.8949 3201.5028 3215.0964 3216.6816 3217.2010 3217.5841 3226.2752
redmass: 1.0900 2.2166 1.2086 3.1445 4.8593 3.6950 4.7620 4.3297 3.6253 3.9825 2.7604 5.0066 4.7029 1.5159 2.4510 3.3992 1.8007 2.3890 2.4532 3.3601 6.6682 6.0827 6.6669 2.7771 1.5133 2.7383 5.4352 1.4699 3.8780 1.3436 1.4112 1.4959 5.5106 1.5298 5.8973 1.3449 1.3222 1.2934 2.2831 2.3305 2.0776 1.5353 1.2350 1.2365 1.1558 1.2140 1.5070 1.0995 1.5858 2.2741 1.7567 2.1222 2.4325 1.6531 2.6537 1.0490 1.5029 5.5282 1.8011 3.1192 2.8581 5.8730 7.3275 5.8394 6.7981 6.4253 1.0211 1.0910 1.0875 1.0883 1.0897 1.0900 1.0892 1.0951 1.1094 1.1098 1.0978 1.0982
irintensity: 184.3760 0.4403 0.0798 0.0317 1.9414 0.6261 0.1177 2.9851 0.2129 2.5003 0.1656 0.3027 1.6235 5.0037 23.4041 0.2773 0.4887 0.1880 0.0447 0.3696 10.2158 0.6971 5.7995 29.5769 73.1178 4.1749 0.6903 8.3474 0.2412 0.3341 12.4254 49.3587 0.7853 26.3737 3.0507 2.5886 2.5612 0.0000 10.9628 1.0432 2.8434 4.1520 3.5370 2.6141 0.9057 0.1315 0.5518 8.3459 1.3442 1.6949 14.2280 11.1596 14.7992 0.8620 3.3177 5.5876 2.5587 0.4301 2.2357 0.1470 1.7358 15.9275 4.4505 0.8068 6.2007 1.0605 3.5620 8.0514 1.1392 0.0142 4.8646 2.5043 1.0602 19.3219 7.6539 8.5247 24.4666 17.4604
temp: 403.150 k
press: 1.00000 atm
elementType: 6 6 6 6 6 6 6 6 6 6 6 1 6 6 6 1 1 1 1 1 1 1 1 1 6 1 1 1
symmnumber: 1
zpe: 585406.2 jmol-1
zpe.correction: 0.222969 hartree
zpe.thermalcorrener: 0.245591 hartree
zpe.thermalcorrenthalpy: 0.246868 hartree
zpe.thermalcorrgfe: 0.161893 hartree
zpe.sumelectzpe: -578.999180 hartree
zpe.sumelectthermal: -578.976558 hartree
zpe.sumelectthermalent: -578.975281 hartree
zpe.sumelectthermalfe: -579.060256 hartree
dipole: -0.0582 -0.1220 0.0014
dipole: 0.1352
quadrupole: -76.4594 -77.0450 -97.2797
quadrupole: 0.6775 0.0829 -0.0752
quadrupole: 7.1353 6.5497 -13.6850 0.6775 0.0829 -0.0752
hfenergy: -579.2221493 hartree
pointgroup: C01 [X(C15H13)]
dipole: -0.0228921 -0.0479966 0.0005352 debye
polarizability: 314.3315356|50.7005743|281.4969453|0.6026479|-0.4215234|109.7668673 unknown
InChI: InChI=1/C15H13/c1-16-15-8-4-7-13-9-11-5-2-3-6-12(11)10-14(13)15/h2-10H,1H3
charge 0 multiplicity 2
28 atoms
C  -2.33752921 -4.14680456 0.00820933
C  -0.9757721 -4.13768846 0.01373862
C  -0.25063457 -2.90377592 0.01170025
C  -0.98699884 -1.67226952 0.00384319
C  -2.41709122 -1.72617151 -0.00182216
C  -3.07021227 -2.92111061 0.00025253
C  1.14542015 -2.86793032 0.01708408
C  -0.29383837 -0.46030353 0.00192877
C  1.10121437 -0.42576065 0.00739943
C  1.84266521 -1.65929193 0.01507645
C  3.27413972 -1.6024387 0.02042501
H  3.82605346 -2.53608753 0.02619751
C  3.93208663 -0.40984578 0.01839686
C  3.20211991 0.82390286 0.01094884
C  1.84978418 0.78415444 0.00578775
H  1.70035547 -3.80137702 0.02299695
H  -2.87601115 -5.08701557 0.00981457
H  -0.415428 -5.06642058 0.01980704
H  -2.96937715 -0.79263537 -0.00785803
H  -4.15329204 -2.95019702 -0.00409091
H  -0.84831761 0.47280391 -0.00399208
H  5.01572007 -0.38381365 0.02248439
H  3.73760751 1.76748238 0.00959434
H  1.14632482 1.97903692 -0.00030446
C  0.51435532 3.1007897 -0.00479875
H  -0.07986611 3.09785515 -0.91548291
H  -0.08599902 3.10154575 0.90186198
H  1.29094956 3.86196688 -0.00370502
