program: Gaussian 16
title: Anthracene 2-CH abs by methyl radical
version: ES64L-G16RevC.01
method: UM062X
basis: 6-311++G(d,p)
operation: Freq
keyword: #P
keyword: Geom=AllCheck
keyword: Guess=TCheck
keyword: SCRF=Check
keyword: GenChk
keyword: UM062X/6-311++G(d,p)
keyword: Freq
converged: YES YES NO YES
polarizability: 3.29437871e+02 8.53413559e+01 2.78406871e+02 3.56940665e+00 -2.10281278e+00 1.10002502e+02
1716.lowfreq: -1455.2315 -4.1803 -0.0006 -0.0006 -0.0003 2.9037 10.8298 28.5490 45.2415
frequency: -1455.2315 28.4352 45.2325 53.7833 99.6161 126.8371 235.4105 236.8372 270.0681 319.2747 381.9702 395.7406 437.4568 452.8296 475.0018 483.9502 518.3971 526.8548 550.1906 592.8399 619.1110 637.9122 686.5161 740.7181 761.4994 772.8742 774.4521 812.3640 832.3492 861.3304 880.9726 916.0241 917.8258 925.5355 930.0311 996.4698 1001.3362 1015.4919 1032.7128 1057.9055 1133.4443 1146.4888 1173.2242 1187.3068 1193.2704 1204.9714 1263.6340 1270.8859 1289.2212 1294.5988 1310.6476 1347.2610 1362.2642 1388.5676 1443.9368 1445.2243 1451.9901 1457.2891 1473.9340 1490.4905 1518.8610 1602.9179 1629.4301 1644.0962 1685.6478 1706.4064 3086.1466 3182.8393 3189.6463 3191.0478 3192.2756 3196.6062 3200.1734 3209.0218 3214.6139 3215.4979 3219.0249 3226.0556
redmass: 1.0922 1.0268 3.5874 3.2261 4.6379 3.7647 4.3149 4.5965 3.5798 4.4463 3.1535 4.3516 5.3704 1.4416 2.4870 2.7244 1.2049 2.6631 6.0871 3.4481 6.6656 6.6251 6.1192 4.0006 1.2567 3.2099 5.3722 1.4363 3.6761 1.2825 1.4479 5.4755 1.5886 1.5058 5.5017 1.3240 1.3563 1.2936 2.2973 2.3112 1.7016 1.7913 1.2569 1.1585 1.1763 1.2230 1.0996 1.4965 2.0959 1.7003 2.1028 1.8225 2.4751 1.6812 3.7330 1.0499 1.6527 2.0100 2.4860 3.0702 2.9935 5.6296 7.4795 6.1098 6.7087 6.4476 1.0212 1.0908 1.0905 1.0893 1.0893 1.0870 1.0891 1.0964 1.0950 1.1094 1.1097 1.0982
irintensity: 261.8466 0.0050 0.7081 0.0815 0.5721 0.1233 2.2770 0.3757 0.5822 1.3849 0.5770 0.1353 0.5529 1.0309 30.2439 4.2017 1.0294 1.1314 0.4401 2.8728 11.1465 0.1880 1.2015 0.2535 84.3218 0.1372 0.2416 9.1998 0.5850 0.0072 1.0258 8.3354 11.6928 83.6969 11.2377 0.2077 6.2882 0.0052 7.6786 0.6777 0.7041 3.2999 12.5387 0.6744 2.0598 0.1069 8.0372 2.8393 1.6881 1.0442 0.3366 15.0110 5.3895 1.3802 1.2026 4.8345 3.7645 2.3007 1.1096 2.9765 0.3930 20.1913 1.6809 4.3889 17.0096 2.1177 5.0327 2.1574 8.5543 4.1474 0.3106 2.8707 0.7847 16.2668 19.5158 8.8210 9.0952 18.6107
temp: 403.150 k
press: 1.00000 atm
elementType: 6 6 6 6 6 6 6 6 6 6 6 1 6 6 6 1 1 1 1 1 1 1 1 1 6 1 1 1
symmnumber: 1
zpe: 585231.8 jmol-1
zpe.correction: 0.222903 hartree
zpe.thermalcorrener: 0.245578 hartree
zpe.thermalcorrenthalpy: 0.246855 hartree
zpe.thermalcorrgfe: 0.160947 hartree
zpe.sumelectzpe: -578.998944 hartree
zpe.sumelectthermal: -578.976269 hartree
zpe.sumelectthermalent: -578.974992 hartree
zpe.sumelectthermalfe: -579.060900 hartree
dipole: -0.0193 -0.1540 0.0083
dipole: 0.1554
quadrupole: -76.6474 -77.2765 -97.2339
quadrupole: -0.3642 0.5635 -0.5307
quadrupole: 7.0719 6.4428 -13.5147 -0.3642 0.5635 -0.5307
hfenergy: -579.2218474 hartree
pointgroup: C01 [X(C15H13)]
dipole: -0.0075981 -0.0605804 0.0032846 debye
polarizability: 329.4378708|85.3413559|278.4068715|3.5694067|-2.1028128|110.0025019 unknown
InChI: InChI=1/C15H13/c1-16-15-7-6-13-8-11-4-2-3-5-12(11)9-14(13)10-15/h2-10H,1H3
charge 0 multiplicity 2
28 atoms
C  -2.59607351 -4.17288566 0.00241167
C  -1.23477773 -4.17788081 0.03808526
C  -0.49666631 -2.95176853 0.02451789
C  -1.21808757 -1.71296378 -0.02731844
C  -2.64826472 -1.75184372 -0.06377357
C  -3.31428584 -2.9396473 -0.04948161
C  0.89879567 -2.9281303 0.06026717
C  -0.51009002 -0.50946828 -0.04047861
C  0.88444965 -0.48647787 -0.00436341
C  1.60809384 -1.72605323 0.04714317
C  3.04012203 -1.69674428 0.0840461
H  3.5754111 -2.63997673 0.1229354
C  3.71773835 -0.51277669 0.07125227
C  2.97922232 0.69766107 0.02037069
C  1.6279454 0.74262336 -0.01637695
H  1.4444731 -3.8660494 0.09959819
H  -3.14514815 -5.10686844 0.01323244
H  -0.68478603 -5.11199703 0.07769889
H  -3.19022674 -0.81307071 -0.10326095
H  -4.39730431 -2.95718609 -0.07731549
H  -1.05622964 0.42810479 -0.07976152
H  4.80153612 -0.49287496 0.09932579
H  3.6714867 1.89569775 0.00999883
H  1.08784471 1.6841864 -0.05490908
C  4.28616545 3.02613319 0.00513361
H  4.94238483 3.00434942 0.87159531
H  4.82206291 3.06379284 -0.93991475
H  3.50130841 3.77479338 0.08228011
