program: Orca
programVersion: 6.1.0
elementType: S S N O C N O C H H N O C H H O C H H C H H C C H C H C C H C H C H H H
charge: 0
multiplicity: 1
keywords: M06L DEF2-TZVP CPCM(DMSO) def2/j verytightscf rijcosx DefGrid3 FREQ
frequency: 0.00 0.00 0.00 0.00 0.00 0.00 28.50 38.25 41.38 51.61 56.26 64.36 105.53 125.84 161.53 179.78 213.25 232.93 243.51 267.72 309.70 319.37 329.78 336.32 368.40 400.25 416.10 418.84 446.35 449.87 480.89 492.81 513.19 533.93 538.57 592.71 615.40 644.66 652.12 664.90 681.37 728.48 806.19 829.44 831.58 851.89 857.33 861.85 875.57 908.59 961.37 985.00 1000.80 1010.24 1020.16 1030.57 1045.17 1053.28 1060.21 1082.41 1118.30 1123.71 1132.53 1144.90 1181.66 1198.18 1208.59 1246.01 1248.09 1270.88 1296.67 1316.16 1330.50 1331.86 1342.79 1352.67 1374.95 1376.69 1387.17 1408.41 1409.10 1434.08 1440.64 1462.60 1471.33 1472.60 1477.04 1482.10 1482.51 1533.33 1622.45 1649.44 1663.30 3004.68 3006.67 3058.63 3074.10 3076.04 3132.20 3133.53 3134.72 3165.97 3175.87 3180.07 3181.29 3189.04 3195.12 3217.10
frequency: 28.50 38.25 41.38 51.61 56.26 64.36 105.53 125.84 161.53 179.78 213.25 232.93 243.51 267.72 309.70 319.37 329.78 336.32 368.40 400.25 416.10 418.84 446.35 449.87 480.89 492.81 513.19 533.93 538.57 592.71 615.40 644.66 652.12 664.90 681.37 728.48 806.19 829.44 831.58 851.89 857.33 861.85 875.57 908.59 961.37 985.00 1000.80 1010.24 1020.16 1030.57 1045.17 1053.28 1060.21 1082.41 1118.30 1123.71 1132.53 1144.90 1181.66 1198.18 1208.59 1246.01 1248.09 1270.88 1296.67 1316.16 1330.50 1331.86 1342.79 1352.67 1374.95 1376.69 1387.17 1408.41 1409.10 1434.08 1440.64 1462.60 1471.33 1472.60 1477.04 1482.10 1482.51 1533.33 1622.45 1649.44 1663.30 3004.68 3006.67 3058.63 3074.10 3076.04 3132.20 3133.53 3134.72 3165.97 3175.87 3180.07 3181.29 3189.04 3195.12 3217.10
formula: C12H15N3O4S2
InChI: InChI=1/C12H15N3O4S2/c1-10-2-4-11(5-3-10)20(16)13-12(21(17,18)14-20)15-6-8-19-9-7-15/h2-5H,6-9H2,1H3
36 atoms
S  0.06285 13.188891 6.523717
S  0.918255 15.346966 7.767909
N  0.978113 13.753597 7.660315
O  -0.858589 12.158513 6.905563
C  -0.348635 15.578044 6.453181
N  -0.710083 14.463556 5.873552
O  0.394599 15.779515 9.036257
C  -1.775863 16.978301 5.073098
H  -2.689539 17.382653 5.513024
H  -1.999631 16.023429 4.607381
N  -0.812489 16.770667 6.159453
O  2.138999 15.971796 7.323422
C  -1.187923 17.958333 4.08037
H  -0.309767 17.513473 3.595053
H  -1.922962 18.198609 3.314395
O  -0.829467 19.174839 4.711772
C  0.14372 18.952356 5.715758
H  0.383463 19.920691 6.151055
H  1.055765 18.531451 5.27256
C  -0.379714 18.019904 6.788202
H  0.380546 17.829768 7.539389
H  -1.248767 18.459694 7.281668
C  1.089356 12.563059 5.246961
C  2.25428 13.242977 4.90624
H  2.545938 14.134874 5.448143
C  3.035247 12.758364 3.877075
H  3.945637 13.280593 3.608786
C  2.676765 11.601606 3.178371
C  1.506528 10.941459 3.544617
H  1.216676 10.041441 3.016501
C  0.70701 11.413039 4.57275
H  -0.199734 10.896147 4.855515
C  3.538121 11.091818 2.072065
H  3.670269 11.849501 1.299181
H  3.115485 10.202997 1.609949
H  4.535517 10.843791 2.436916
elementType: S N O C H
totalener: -1728.04389412717273 hartree
nucrepener: 2165.79098618236458 hartree
electener: -3893.80548962964349 hartree
oneelecener: -6676.07835141331270 hartree
twoeener: 2782.27286178366921 hartree
cpcmener: -0.02939067989378 hartree
kineticenergy: 1723.03160474326774 hartree
xcener: -177.865186830733 hartree
energy: -2414.6423 -2414.6057 -516.6037 -516.4946 -516.3442 -516.3315 -387.8845 -386.3937 -386.0599 -276.9420 -275.0050 -274.9994 -274.9259 -274.8190 -274.5535 -274.1871 -274.0781 -274.0674 -273.7622 -273.7439 -273.3442 -219.6194 -219.5145 -162.7948 -162.6859 -162.6750 -162.6682 -162.5870 -162.5653 -30.1584 -29.3472 -28.0197 -27.1395 -26.8074 -25.6870 -23.8408 -23.0375 -21.0707 -20.7204 -20.1044 -19.8859 -18.9778 -17.9382 -17.6448 -16.5940 -16.3581 -16.0793 -15.4117 -15.2064 -14.2840 -14.0126 -13.2177 -12.6740 -12.5213 -12.4316 -12.2483 -12.1733 -12.0892 -11.9634 -11.8429 -11.3849 -11.2750 -10.9165 -10.7124 -10.5282 -10.3977 -10.1036 -9.7439 -9.7133 -9.5177 -9.4375 -9.3327 -9.2430 -9.0228 -8.7596 -8.6704 -8.4403 -8.2576 -8.2167 -8.0024 -7.4787 -7.2707 -7.0271 -6.8419 -6.6080 -6.1953 -2.1262 -1.5169 -1.3054 0.2734 0.6840 0.9903 1.4013 1.5673 1.6743 1.6930 1.9359 electronvolt
chargesum: -0.0000000
charge: 1.062702 1.088922 -0.603470 -0.597709 0.502449 -0.630729 -0.590372 0.014765 0.086871 0.106182 -0.267067 -0.578648 0.143613 0.066473 0.065586 -0.486404 0.136210 0.066562 0.067364 -0.006808 0.105960 0.090154 0.030661 -0.122665 0.158472 -0.255358 0.091825 0.236091 -0.198681 0.091359 -0.065363 0.120720 -0.167136 0.082881 0.071351 0.083237
charge: 0.806074 0.600606 -0.416042 -0.267456 -0.419966 -0.126091 -0.298828 -0.190305 0.140864 0.142835 0.230515 -0.302073 -0.276143 0.121016 0.130200 0.135784 -0.276784 0.130569 0.120281 -0.204994 0.136338 0.141219 -0.281462 -0.108590 0.146153 -0.083715 0.148305 -0.144034 -0.089835 0.147101 -0.103608 0.148874 -0.212785 0.127481 0.120545 0.127952
qa: 1.0627 1.0889 -0.6035 -0.5977 0.5024 -0.6307 -0.5904 0.0148 0.0869 0.1062 -0.2671 -0.5786 0.1436 0.0665 0.0656 -0.4864 0.1362 0.0666 0.0674 -0.0068 0.1060 0.0902 0.0307 -0.1227 0.1585 -0.2554 0.0918 0.2361 -0.1987 0.0914 -0.0654 0.1207 -0.1671 0.0829 0.0714 0.0832
va: 5.3450 5.5897 2.6729 1.8947 3.8021 2.7331 1.8827 3.7040 0.9939 1.0009 3.1967 1.8989 3.7846 0.9924 0.9911 1.7748 3.7570 0.9924 0.9970 3.7410 1.0098 0.9945 3.8416 3.8954 0.9658 3.9838 0.9967 3.6025 3.9047 0.9896 3.8465 0.9879 3.7894 0.9723 0.9883 0.9718
energy: -1728.043894127173 hartree
dipole: 3.767620273 -3.859261537 -0.091641264 4.662957216 -3.875693235 0.787263981 -20.288836746 16.679126381 -3.609710365
dipolemethod: SCF
magnitude: 3.695699070 au
magnitude: 9.393720505 debye
temp: 298.15 k
press: 1.00 atm
zeropoint: 0.27732671 hartree
thermalvibcorrection: 0.01622954 hartree
thermalrotcorrection: 0.00141627 hartree
thermaltrasncorrection: 0.00141627 hartree
thermaltotal: -1727.74750533 hartree
thermalcorr: 0.01906209 hartree
nonthermalcorr: 0.27732671 hartree
totalcorr: 0.29638879 hartree
thermalcorrenthalpy: 0.00094421 hartree
totalenthalpy: -1727.74656112 hartree
vibrat: 0.02843867 hartree
rotat: 0.01642939 hartree
transl: 0.02055954 hartree
total: 0.06542760 hartree
totalentropycorr: -0.06542760 hartree
gibbsenthalpy: -1727.81198872 hartree
gibbsminuselec: 0.23190541 hartree
