program: Orca
programVersion: 6.1.0
elementType: S S N O C N O C H H N O C H H O C H H C H H C C H C H C C H C H C H H H
charge: 0
multiplicity: 1
keywords: B97-D4 DEF2-TZVP CPCM(DMSO) def2/j verytightscf rijcosx DefGrid3 FREQ
frequency: 0.00 0.00 0.00 0.00 0.00 0.00 19.66 25.18 33.31 42.45 52.29 53.25 98.19 121.10 157.29 173.50 204.94 225.58 240.98 260.40 301.37 310.25 319.65 328.83 364.99 387.20 398.86 409.23 436.07 443.60 469.41 479.18 497.95 520.04 524.56 580.12 604.54 629.40 634.60 645.39 668.35 702.86 775.85 801.24 810.07 822.09 823.93 829.57 838.86 878.05 929.20 952.07 954.95 979.79 986.17 994.78 1017.00 1020.58 1034.44 1052.79 1077.99 1089.18 1107.61 1115.68 1125.61 1160.40 1187.19 1212.27 1217.14 1227.99 1249.95 1259.13 1268.54 1297.02 1311.82 1331.12 1343.44 1348.86 1355.38 1371.97 1373.43 1399.73 1402.20 1441.27 1443.01 1446.44 1449.85 1452.98 1458.42 1495.82 1579.00 1596.63 1640.71 2946.93 2948.67 2978.93 3013.76 3016.37 3038.55 3059.85 3061.21 3071.91 3108.89 3123.70 3131.28 3132.44 3164.53 3168.07
frequency: 19.66 25.18 33.31 42.45 52.29 53.25 98.19 121.10 157.29 173.50 204.94 225.58 240.98 260.40 301.37 310.25 319.65 328.83 364.99 387.20 398.86 409.23 436.07 443.60 469.41 479.18 497.95 520.04 524.56 580.12 604.54 629.40 634.60 645.39 668.35 702.86 775.85 801.24 810.07 822.09 823.93 829.57 838.86 878.05 929.20 952.07 954.95 979.79 986.17 994.78 1017.00 1020.58 1034.44 1052.79 1077.99 1089.18 1107.61 1115.68 1125.61 1160.40 1187.19 1212.27 1217.14 1227.99 1249.95 1259.13 1268.54 1297.02 1311.82 1331.12 1343.44 1348.86 1355.38 1371.97 1373.43 1399.73 1402.20 1441.27 1443.01 1446.44 1449.85 1452.98 1458.42 1495.82 1579.00 1596.63 1640.71 2946.93 2948.67 2978.93 3013.76 3016.37 3038.55 3059.85 3061.21 3071.91 3108.89 3123.70 3131.28 3132.44 3164.53 3168.07
formula: C12H15N3O4S2
InChI: InChI=1/C12H15N3O4S2/c1-10-2-4-11(5-3-10)20(16)13-12(21(17,18)14-20)15-6-8-19-9-7-15/h2-5H,6-9H2,1H3
36 atoms
S  0.113656 13.186539 6.559948
S  0.940465 15.382479 7.788457
N  1.054075 13.776549 7.677033
O  -0.807307 12.153423 6.979693
C  -0.339935 15.586699 6.463971
N  -0.686287 14.456088 5.898913
O  0.386774 15.794454 9.065557
C  -1.818309 16.951654 5.09862
H  -2.724244 17.374715 5.547155
H  -2.048419 15.982858 4.655894
N  -0.828841 16.771884 6.17435
O  2.164748 16.039879 7.363504
C  -1.241076 17.908117 4.058994
H  -0.371083 17.442353 3.569872
H  -1.999743 18.13525 3.304883
O  -0.861584 19.150562 4.654624
C  0.128743 18.951576 5.664826
H  0.362898 19.936104 6.079088
H  1.039081 18.51656 5.223144
C  -0.388254 18.038361 6.773628
H  0.389615 17.868105 7.515465
H  -1.255527 18.491598 7.266613
C  1.123732 12.559999 5.272388
C  2.330917 13.195316 4.98211
H  2.665563 14.041454 5.572665
C  3.099825 12.719102 3.928493
H  4.04361 13.206251 3.69618
C  2.682672 11.619891 3.163215
C  1.4634 11.007531 3.47905
H  1.123218 10.156461 2.894484
C  0.676848 11.468751 4.529644
H  -0.266027 10.989726 4.769581
C  3.542552 11.095746 2.048323
H  4.075811 11.907805 1.543873
H  2.949047 10.547251 1.311006
H  4.299361 10.405623 2.444919
elementType: S N O C H
totalener: -1727.51258346284294 hartree
nucrepener: 2155.02469029830309 hartree
electener: -3882.50532601122313 hartree
oneelecener: -6655.65658774413441 hartree
twoeener: 2773.15126173291128 hartree
cpcmener: -0.03194774992278 hartree
kineticenergy: 1723.15929505719077 hartree
exchangeener: -169.222499296480 hartree
correlationener: -7.937620484620 hartree
xcener: -177.160119781101 hartree
energy: -2400.4000 -2400.3973 -510.7382 -510.6641 -510.5239 -510.5225 -382.9945 -381.5933 -381.2671 -272.8669 -270.9403 -270.9378 -270.8404 -270.7584 -270.6446 -270.2189 -270.1187 -270.1083 -269.8169 -269.8098 -269.3411 -214.6655 -214.5948 -161.1153 -161.0398 -161.0078 -161.0023 -160.9513 -160.9422 -28.5877 -27.7771 -26.3646 -25.4848 -25.4587 -24.3698 -22.6488 -21.9740 -20.1282 -19.7650 -19.2355 -18.9796 -18.1949 -17.1614 -16.9588 -15.9713 -15.7165 -15.4577 -14.8231 -14.6825 -13.8049 -13.5964 -12.7136 -12.2211 -12.0805 -12.0019 -11.8528 -11.7693 -11.6638 -11.5709 -11.4456 -10.9958 -10.9217 -10.6621 -10.3692 -10.1321 -9.9543 -9.7549 -9.4349 -9.4120 -9.2254 -9.1046 -9.0534 -8.9344 -8.6954 -8.5386 -8.4090 -8.1679 -7.9823 -7.9197 -7.7440 -7.2565 -7.0358 -6.7510 -6.6661 -6.4071 -5.9665 -2.3255 -1.7130 -1.5144 -0.2349 0.2221 0.3025 0.8016 1.0379 1.1125 1.2160 1.3394 electronvolt
chargesum: 0.0000000
charge: 0.726966 0.741215 -0.433924 -0.453391 0.103054 -0.357287 -0.462650 -0.101584 0.124859 0.144679 0.036665 -0.453443 -0.042539 0.097965 0.130159 -0.320210 -0.034521 0.130182 0.093712 -0.114378 0.140210 0.123639 0.117741 -0.148999 0.138357 -0.210978 0.128315 0.197208 -0.188624 0.129222 -0.173272 0.141975 -0.358773 0.135658 0.135254 0.137536
charge: 0.779879 0.578712 -0.402754 -0.262675 -0.436402 -0.109278 -0.293951 -0.208381 0.149744 0.151570 0.240523 -0.294265 -0.295573 0.130381 0.140002 0.139948 -0.295973 0.140227 0.129448 -0.223584 0.145463 0.149554 -0.284530 -0.113864 0.155180 -0.093796 0.157590 -0.143577 -0.095806 0.157103 -0.112351 0.157393 -0.242625 0.134291 0.132957 0.139422
qa: 0.7270 0.7412 -0.4339 -0.4534 0.1031 -0.3573 -0.4626 -0.1016 0.1249 0.1447 0.0367 -0.4534 -0.0425 0.0980 0.1302 -0.3202 -0.0345 0.1302 0.0937 -0.1144 0.1402 0.1236 0.1177 -0.1490 0.1384 -0.2110 0.1283 0.1972 -0.1886 0.1292 -0.1733 0.1420 -0.3588 0.1357 0.1353 0.1375
va: 5.6652 5.8507 2.7759 2.0666 4.0679 2.9075 2.0255 3.8874 0.9798 0.9939 3.4349 2.0149 4.0710 0.9758 0.9594 2.0461 4.0340 0.9600 0.9841 3.9229 1.0098 0.9796 3.6620 3.8828 0.9955 3.8872 0.9697 3.6776 3.9015 0.9682 3.9252 0.9834 3.8518 0.9696 0.9713 0.9645
dispersion: -0.198414455 hartree
energy: -1727.710997917743 hartree
dipole: 3.414682559 -3.529121781 -0.114439223 4.473116541 -3.729110016 0.744006525 -20.575125142 16.778437006 -3.796688136
dipolemethod: SCF
magnitude: 3.870592054 au
magnitude: 9.838263141 debye
temp: 298.15 k
press: 1.00 atm
zeropoint: 0.27034768 hartree
thermalvibcorrection: 0.01678335 hartree
thermalrotcorrection: 0.00141627 hartree
thermaltrasncorrection: 0.00141627 hartree
thermaltotal: -1727.42103434 hartree
thermalcorr: 0.01961589 hartree
nonthermalcorr: 0.27034768 hartree
totalcorr: 0.28996358 hartree
thermalcorrenthalpy: 0.00094421 hartree
totalenthalpy: -1727.42009013 hartree
vibrat: 0.02979244 hartree
rotat: 0.01644203 hartree
transl: 0.02055954 hartree
total: 0.06679400 hartree
totalentropycorr: -0.06679400 hartree
gibbsenthalpy: -1727.48688414 hartree
gibbsminuselec: 0.22411378 hartree
