program: Orca
programVersion: 6.1.0
elementType: S C N O C N O C H C H C C H C H C H H H C C H C H C H C H C H
charge: 0
multiplicity: 1
keywords: LibXC(MN15) DEF2-TZVP CPCM(DMSO) def2/j verytightscf rijcosx DefGrid3 FREQ
frequency: 0.00 0.00 0.00 0.00 0.00 0.00 18.14 28.93 29.99 38.36 87.14 109.35 120.04 175.38 209.72 237.88 261.87 296.93 312.65 338.81 375.62 404.30 408.65 410.86 452.40 471.10 510.28 525.02 603.60 611.17 626.30 679.14 699.16 709.94 719.58 736.36 807.33 822.00 832.64 853.78 863.07 863.45 877.19 947.20 967.15 990.59 996.51 1006.67 1007.11 1010.40 1016.73 1028.16 1037.52 1048.78 1050.04 1101.28 1121.35 1124.29 1158.71 1169.08 1181.88 1186.15 1240.21 1294.96 1314.65 1325.93 1342.55 1347.80 1390.20 1394.21 1424.53 1452.71 1462.71 1478.75 1521.11 1526.14 1589.04 1634.78 1647.48 1653.26 1661.91 3070.20 3138.39 3167.56 3215.27 3218.28 3221.58 3230.68 3231.56 3236.60 3243.85 3247.69 3253.71
frequency: 18.14 28.93 29.99 38.36 87.14 109.35 120.04 175.38 209.72 237.88 261.87 296.93 312.65 338.81 375.62 404.30 408.65 410.86 452.40 471.10 510.28 525.02 603.60 611.17 626.30 679.14 699.16 709.94 719.58 736.36 807.33 822.00 832.64 853.78 863.07 863.45 877.19 947.20 967.15 990.59 996.51 1006.67 1007.11 1010.40 1016.73 1028.16 1037.52 1048.78 1050.04 1101.28 1121.35 1124.29 1158.71 1169.08 1181.88 1186.15 1240.21 1294.96 1314.65 1325.93 1342.55 1347.80 1390.20 1394.21 1424.53 1452.71 1462.71 1478.75 1521.11 1526.14 1589.04 1634.78 1647.48 1653.26 1661.91 3070.20 3138.39 3167.56 3215.27 3218.28 3221.58 3230.68 3231.56 3236.60 3243.85 3247.69 3253.71
formula: C14H12N2O2S
InChI: InChI=1/C14H12N2O2S/c1-11-7-9-13(10-8-11)19(17)15-14(18-16-19)12-5-3-2-4-6-12/h2-10H,1H3
31 atoms
S  0.749244 2.47334 -4.039366
C  1.430859 1.77152 -1.909847
N  -0.462486 2.055425 -3.112267
O  0.11428 1.816961 -1.833389
C  0.71599 1.448829 -5.446173
N  1.965834 2.021777 -3.07226
O  0.883975 3.826454 -4.502069
C  0.501897 0.083508 -5.269948
H  0.343706 -0.31612 -4.275537
C  0.4949 -0.740804 -6.379849
H  0.333066 -1.805231 -6.257912
C  0.69108 -0.218905 -7.663545
C  0.904176 1.151763 -7.809508
H  1.060978 1.56263 -8.799647
C  0.919922 1.994552 -6.707151
H  1.085811 3.057431 -6.817154
C  0.651555 -1.122835 -8.85911
H  1.067545 -0.632006 -9.737702
H  1.205111 -2.042859 -8.669545
H  -0.379449 -1.404527 -9.084351
C  2.169314 1.452237 -0.691143
C  1.48684 1.132562 0.48431
H  0.405026 1.120748 0.495867
C  2.205254 0.829369 1.630736
H  1.680867 0.580857 2.544046
C  3.596859 0.843104 1.605339
H  4.154109 0.605185 2.502519
C  4.275677 1.161226 0.432358
H  5.357567 1.17186 0.416055
C  3.564815 1.467436 -0.717457
H  4.077611 1.720562 -1.636326
elementType: S C N O H
totalener: -1198.02983377308465 hartree
nucrepener: 1492.86310248348718 hartree
electener: -2690.87003012836931 hartree
oneelecener: -4602.13961325477521 hartree
twoeener: 1911.26958312640591 hartree
cpcmener: -0.02290673790951 hartree
kineticenergy: 1191.08563301789445 hartree
exchangeener: -74.600403728188 hartree
correlationener: -3.767164739328 hartree
xcener: -78.367568467516 hartree
energy: -2394.5025 -514.8989 -512.2531 -384.7757 -384.4289 -277.2694 -274.5438 -274.3494 -274.2102 -274.1027 -274.0924 -273.9490 -273.9278 -273.8228 -273.7254 -273.7184 -273.7145 -273.7096 -273.1686 -214.5251 -165.3575 -165.2448 -165.2145 -33.1624 -30.8558 -27.1527 -25.8100 -25.2999 -24.8047 -22.9847 -22.2820 -22.0701 -21.9770 -20.7800 -19.4791 -19.2958 -18.2820 -18.0252 -17.7667 -17.3706 -16.6093 -16.1283 -15.2905 -14.6430 -14.5009 -14.2306 -14.0224 -13.8075 -13.7006 -13.2685 -13.0797 -13.0407 -12.9295 -12.8377 -12.0464 -11.8042 -11.6598 -11.6186 -11.3041 -11.0890 -10.9737 -10.7157 -10.6721 -10.3138 -10.2005 -9.7786 -8.6773 -8.4605 -8.3900 -8.3137 -7.7682 -1.4718 -0.8690 -0.1427 -0.0309 1.3119 1.5499 2.3621 2.5531 2.7784 2.8735 3.0620 electronvolt
chargesum: -0.0000000
charge: 0.635894 0.320800 -0.366849 -0.095223 -0.002858 -0.333098 -0.426509 -0.175189 0.212523 -0.201553 0.191654 0.104196 -0.222880 0.189078 -0.146237 0.206645 -0.442735 0.150916 0.160953 0.167551 -0.041514 -0.144044 0.193604 -0.197034 0.184958 -0.138536 0.185719 -0.199567 0.184867 -0.144386 0.188855
charge: 0.770451 -0.370591 -0.363180 0.246516 -0.296314 -0.087244 -0.281687 -0.110325 0.161568 -0.095644 0.160003 -0.144154 -0.100513 0.158839 -0.106528 0.159716 -0.241326 0.132694 0.136156 0.140018 -0.133170 -0.078794 0.160011 -0.127135 0.155366 -0.112053 0.155364 -0.127069 0.155301 -0.076083 0.159806
qa: 0.6359 0.3208 -0.3668 -0.0952 -0.0029 -0.3331 -0.4265 -0.1752 0.2125 -0.2016 0.1917 0.1042 -0.2229 0.1891 -0.1462 0.2066 -0.4427 0.1509 0.1610 0.1676 -0.0415 -0.1440 0.1936 -0.1970 0.1850 -0.1385 0.1857 -0.1996 0.1849 -0.1444 0.1889
va: 5.7867 4.1757 2.5035 2.2978 3.8178 2.9912 2.0812 4.0008 0.9551 3.9328 0.9567 3.7857 3.9880 0.9570 4.0159 0.9669 3.8327 0.9583 0.9479 0.9426 3.8213 3.9361 0.9668 3.9390 0.9610 3.9281 0.9577 3.9445 0.9610 3.9502 0.9758
energy: -1198.029833773085 hartree
dipole: 4.020266487 -2.751292794 1.268973693 -11.697017312 9.259167920 -2.437849392 -7.573480995 7.439492442 -0.133988554
dipolemethod: SCF
magnitude: 2.751609861 au
magnitude: 6.994036441 debye
temp: 298.15 k
press: 1.00 atm
zeropoint: 0.23569007 hartree
thermalvibcorrection: 0.01335824 hartree
thermalrotcorrection: 0.00141627 hartree
thermaltrasncorrection: 0.00141627 hartree
thermaltotal: -1197.77795292 hartree
thermalcorr: 0.01619078 hartree
nonthermalcorr: 0.23569007 hartree
totalcorr: 0.25188085 hartree
thermalcorrenthalpy: 0.00094421 hartree
totalenthalpy: -1197.77700872 hartree
vibrat: 0.02381705 hartree
rotat: 0.01612214 hartree
transl: 0.02029008 hartree
total: 0.06022927 hartree
totalentropycorr: -0.06022927 hartree
gibbsenthalpy: -1197.83723799 hartree
gibbsminuselec: 0.19259579 hartree
