program: Orca
programVersion: 6.1.0
elementType: S S C N O C H H N C H H N O C H H C H H C C H C H C C H C H C H H H
charge: 0
multiplicity: 1
keywords: BP86 DEF2-TZVP CPCM(DMSO) def2/j verytightscf rijcosx DefGrid3 FREQ
frequency: 0.00 0.00 0.00 0.00 0.00 0.00 19.28 22.99 29.91 45.32 53.89 82.39 115.58 130.59 173.25 190.38 222.07 237.35 252.82 288.88 295.82 311.04 355.99 376.82 395.48 398.51 422.42 456.22 469.13 493.31 504.46 547.34 571.62 609.51 623.44 644.02 662.98 695.29 709.02 781.24 796.96 801.07 815.74 824.38 834.96 883.06 908.26 931.24 941.31 946.28 974.67 990.81 1001.60 1005.59 1019.89 1042.86 1064.12 1070.95 1090.37 1098.34 1157.28 1161.07 1169.56 1194.63 1198.93 1211.04 1249.57 1279.29 1281.71 1305.70 1314.38 1329.68 1339.77 1351.28 1351.89 1365.19 1381.47 1407.99 1418.75 1419.88 1425.52 1427.03 1433.25 1470.64 1540.28 1559.60 1578.57 2921.16 2921.58 2949.12 2949.90 2962.66 3009.39 3019.28 3036.81 3038.66 3053.39 3063.97 3100.33 3103.09 3125.42 3135.72
frequency: 19.28 22.99 29.91 45.32 53.89 82.39 115.58 130.59 173.25 190.38 222.07 237.35 252.82 288.88 295.82 311.04 355.99 376.82 395.48 398.51 422.42 456.22 469.13 493.31 504.46 547.34 571.62 609.51 623.44 644.02 662.98 695.29 709.02 781.24 796.96 801.07 815.74 824.38 834.96 883.06 908.26 931.24 941.31 946.28 974.67 990.81 1001.60 1005.59 1019.89 1042.86 1064.12 1070.95 1090.37 1098.34 1157.28 1161.07 1169.56 1194.63 1198.93 1211.04 1249.57 1279.29 1281.71 1305.70 1314.38 1329.68 1339.77 1351.28 1351.89 1365.19 1381.47 1407.99 1418.75 1419.88 1425.52 1427.03 1433.25 1470.64 1540.28 1559.60 1578.57 2921.16 2921.58 2949.12 2949.90 2962.66 3009.39 3019.28 3036.81 3038.66 3053.39 3063.97 3100.33 3103.09 3125.42 3135.72
formula: C12H15N3O2S2
InChI: InChI=1/C12H15N3O2S2/c1-10-2-4-11(5-3-10)19(16)13-12(18-14-19)15-6-8-17-9-7-15/h2-5H,6-9H2,1H3
34 atoms
S  5.572773 5.225547 3.482529
S  4.732678 3.768785 5.578476
C  6.460243 3.671374 5.161328
N  4.280036 4.617804 4.171446
O  5.8441 6.665606 3.572259
C  6.878122 2.290982 7.145147
H  5.795661 2.098864 7.094247
H  7.080079 2.941477 8.013123
N  6.830529 4.355286 4.083302
C  7.615086 0.96083 7.295716
H  7.391053 0.521298 8.276327
H  7.292385 0.261092 6.502164
N  7.313135 2.962619 5.917315
O  9.034607 1.141729 7.233694
C  9.404728 1.690848 5.960496
H  9.100509 0.997175 5.154465
H  10.498595 1.783971 5.960802
C  8.770122 3.059993 5.740196
H  9.171589 3.784866 6.469522
H  8.981219 3.423179 4.728263
C  5.451646 4.839502 1.74924
C  5.779583 5.810178 0.798562
H  6.092947 6.803297 1.118557
C  5.696752 5.487963 -0.557872
H  5.952679 6.244404 -1.302527
C  5.290958 4.212138 -0.980296
C  4.970303 3.253854 0.000393
H  4.65512 2.254419 -0.306754
C  5.046098 3.556897 1.357244
H  4.790252 2.808483 2.107792
C  5.180895 3.876471 -2.443621
H  4.12394 3.83855 -2.752557
H  5.613167 2.888526 -2.65775
H  5.686387 4.626104 -3.065848
elementType: S C N O H
totalener: -1577.77122858465623 hartree
nucrepener: 1742.99825380275911 hartree
electener: -3320.74131777307184 hartree
oneelecener: -5627.58120285279711 hartree
twoeener: 2306.83988507972526 hartree
cpcmener: -0.02816461434361 hartree
kineticenergy: 1572.47681473573743 hartree
exchangeener: -154.368655009011 hartree
correlationener: -5.999578708267 hartree
xcener: -160.368233717279 hartree
energy: -2402.1976 -2398.6065 -511.1979 -510.6997 -382.6124 -381.3598 -381.1717 -272.5340 -270.7816 -270.7437 -270.6548 -270.5036 -270.5005 -270.1396 -269.9910 -269.9758 -269.7300 -269.7194 -269.2698 -213.1504 -210.1792 -159.3187 -159.2329 -159.2149 -156.3815 -156.2276 -156.0652 -27.2730 -26.2276 -25.0766 -23.8241 -21.9803 -21.8296 -20.0965 -19.6444 -19.2392 -18.8690 -18.0567 -17.3301 -16.7910 -15.7450 -15.4583 -15.3858 -14.5125 -14.0845 -13.3941 -13.3017 -12.2564 -12.0344 -11.9616 -11.8112 -11.5638 -11.4105 -11.3384 -11.0612 -10.9208 -10.6010 -10.4389 -10.3085 -9.9574 -9.6232 -9.4455 -9.3625 -9.2633 -8.9692 -8.8859 -8.6845 -8.4877 -8.1542 -7.8813 -7.7372 -7.5529 -7.2084 -6.8085 -6.7584 -6.4527 -6.0559 -5.1475 -2.3269 -1.6541 -1.3259 -1.2097 0.3578 0.4969 0.7736 1.0774 1.1057 1.1366 1.2987 electronvolt
chargesum: -0.0000000
charge: 0.648901 0.033424 0.148484 -0.452835 -0.468440 -0.159618 0.152631 0.138349 -0.367692 -0.075975 0.138531 0.115764 -0.018229 -0.311456 -0.084133 0.116571 0.137524 -0.133399 0.128166 0.155136 0.100206 -0.159856 0.160335 -0.204087 0.148181 0.157000 -0.196230 0.147438 -0.208251 0.162879 -0.391748 0.149947 0.147840 0.144639
charge: 0.742622 0.504951 -0.579821 -0.519450 -0.304702 -0.254379 0.150504 0.147588 -0.142643 -0.312102 0.142595 0.132145 0.208173 0.142198 -0.311763 0.131699 0.142273 -0.239062 0.147022 0.153899 -0.282232 -0.122519 0.159045 -0.105874 0.159937 -0.151490 -0.101599 0.160855 -0.123109 0.161444 -0.254910 0.143052 0.139592 0.136062
qa: 0.6489 0.0334 0.1485 -0.4528 -0.4684 -0.1596 0.1526 0.1383 -0.3677 -0.0760 0.1385 0.1158 -0.0182 -0.3115 -0.0841 0.1166 0.1375 -0.1334 0.1282 0.1551 0.1002 -0.1599 0.1603 -0.2041 0.1482 0.1570 -0.1962 0.1474 -0.2083 0.1629 -0.3917 0.1499 0.1478 0.1446
va: 5.6304 2.6451 4.1466 2.6749 2.0103 3.8958 0.9729 0.9719 2.8778 3.9950 0.9605 0.9770 3.3007 2.0276 4.0066 0.9748 0.9608 3.8214 0.9764 0.9868 3.6137 3.9219 0.9854 3.9178 0.9671 3.6571 3.8590 0.9665 3.9465 0.9715 3.8437 0.9580 0.9617 0.9689
energy: -1577.771228584656 hartree
dipole: 8.510719158 -7.419043032 1.091676127 -11.459596559 8.948682832 -2.510913727 -8.676253995 7.948177360 -0.728076635
dipolemethod: SCF
magnitude: 2.833114911 au
magnitude: 7.201205814 debye
temp: 298.15 k
press: 1.00 atm
zeropoint: 0.25730818 hartree
thermalvibcorrection: 0.01548084 hartree
thermalrotcorrection: 0.00141627 hartree
thermaltrasncorrection: 0.00141627 hartree
thermaltotal: -1577.49560702 hartree
thermalcorr: 0.01831338 hartree
nonthermalcorr: 0.25730818 hartree
totalcorr: 0.27562157 hartree
thermalcorrenthalpy: 0.00094421 hartree
totalenthalpy: -1577.49466281 hartree
vibrat: 0.02763316 hartree
rotat: 0.01632387 hartree
transl: 0.02041480 hartree
total: 0.06437183 hartree
totalentropycorr: -0.06437183 hartree
gibbsenthalpy: -1577.55903464 hartree
gibbsminuselec: 0.21219394 hartree
