program: Orca
programVersion: 6.1.0
elementType: S C N O C N O C H C H C C H C H C H H H C C H C H C H C H C H
charge: 0
multiplicity: 1
keywords: O3LYP DEF2-TZVP CPCM(DMSO) def2/j verytightscf rijcosx DefGrid3 FREQ
frequency: 0.00 0.00 0.00 0.00 0.00 0.00 27.23 28.87 30.55 35.72 84.88 111.81 118.35 168.80 210.74 235.60 266.45 289.79 312.50 342.62 373.04 402.95 408.70 410.25 451.11 475.04 504.78 521.69 605.14 622.01 637.30 685.13 695.22 702.71 722.11 731.32 797.52 816.12 823.38 839.63 841.95 848.46 855.18 948.21 950.98 973.00 974.22 974.85 977.68 997.25 999.39 1013.55 1027.11 1042.24 1048.77 1101.83 1108.01 1128.57 1151.88 1164.59 1183.27 1189.83 1239.52 1262.17 1312.28 1322.89 1359.05 1372.44 1378.80 1387.37 1421.89 1443.42 1454.33 1471.09 1512.00 1515.85 1573.51 1618.38 1631.11 1640.17 1649.95 3035.88 3102.07 3137.39 3179.54 3180.85 3182.57 3189.74 3197.48 3205.23 3208.26 3209.90 3218.39
frequency: 27.23 28.87 30.55 35.72 84.88 111.81 118.35 168.80 210.74 235.60 266.45 289.79 312.50 342.62 373.04 402.95 408.70 410.25 451.11 475.04 504.78 521.69 605.14 622.01 637.30 685.13 695.22 702.71 722.11 731.32 797.52 816.12 823.38 839.63 841.95 848.46 855.18 948.21 950.98 973.00 974.22 974.85 977.68 997.25 999.39 1013.55 1027.11 1042.24 1048.77 1101.83 1108.01 1128.57 1151.88 1164.59 1183.27 1189.83 1239.52 1262.17 1312.28 1322.89 1359.05 1372.44 1378.80 1387.37 1421.89 1443.42 1454.33 1471.09 1512.00 1515.85 1573.51 1618.38 1631.11 1640.17 1649.95 3035.88 3102.07 3137.39 3179.54 3180.85 3182.57 3189.74 3197.48 3205.23 3208.26 3209.90 3218.39
formula: C14H12N2O2S
InChI: InChI=1/C14H12N2O2S/c1-11-7-9-13(10-8-11)19(17)15-14(18-16-19)12-5-3-2-4-6-12/h2-10H,1H3
31 atoms
S  0.722703 2.442292 -4.022671
C  1.435152 1.753187 -1.898943
N  -0.478191 1.996757 -3.076133
O  0.115411 1.761458 -1.815674
C  0.698989 1.419703 -5.438986
N  1.958015 2.017493 -3.061213
O  0.821081 3.802898 -4.488639
C  0.482377 0.056481 -5.285963
H  0.314745 -0.363267 -4.302044
C  0.480147 -0.75213 -6.402553
H  0.313569 -1.817138 -6.286178
C  0.685557 -0.223984 -7.677084
C  0.901378 1.145261 -7.800132
H  1.066848 1.573409 -8.782227
C  0.909743 1.972148 -6.692843
H  1.077156 3.035698 -6.796127
C  0.651943 -1.106841 -8.876457
H  1.107245 -0.624579 -9.740775
H  1.16527 -2.050708 -8.686643
H  -0.381486 -1.352695 -9.138078
C  2.177868 1.456024 -0.68853
C  1.514381 1.096359 0.48388
H  0.433901 1.035587 0.499985
C  2.240634 0.813517 1.624183
H  1.722872 0.533593 2.533712
C  3.625509 0.88509 1.605044
H  4.191196 0.66179 2.502118
C  4.287249 1.241938 0.439739
H  5.368984 1.299408 0.423797
C  3.569524 1.528195 -0.704872
H  4.07891 1.811821 -1.61684
elementType: S C N O H
totalener: -1197.24228359138010 hartree
nucrepener: 1492.87464956372878 hartree
electener: -2690.09512211924402 hartree
oneelecener: -4603.34512588108464 hartree
twoeener: 1913.25000376184062 hartree
cpcmener: -0.02180878182362 hartree
kineticenergy: 1193.60324217885000 hartree
exchangeener: -114.448037635149 hartree
correlationener: -5.873173649178 hartree
xcener: -120.321211284327 hartree
energy: -2411.7674 -518.4358 -515.7006 -386.4032 -385.9989 -276.6206 -274.2953 -274.0771 -273.9032 -273.7568 -273.7418 -273.6195 -273.5936 -273.5006 -273.4251 -273.4216 -273.4169 -273.4142 -272.8927 -217.7686 -163.1191 -163.0143 -162.9890 -31.1319 -28.8122 -25.1647 -23.8046 -23.2935 -22.8358 -21.0807 -20.4094 -20.1726 -20.0918 -18.9742 -17.6995 -17.6207 -16.4822 -16.2621 -16.0298 -15.6522 -14.7910 -14.2845 -13.4174 -12.8840 -12.7680 -12.5761 -12.3224 -12.1007 -12.0701 -11.5842 -11.4197 -11.3632 -11.2663 -11.1686 -10.3658 -10.1673 -10.0201 -9.9730 -9.6817 -9.4977 -9.4129 -9.1416 -9.0938 -8.7324 -8.5006 -8.1125 -7.4006 -7.2492 -7.1888 -7.0570 -6.3227 -2.3544 -1.7945 -1.0875 -1.0002 0.0854 0.4329 0.9859 1.2147 1.4025 1.4564 1.8323 electronvolt
chargesum: -0.0000000
charge: 0.628316 0.234522 -0.367973 -0.079170 0.164493 -0.278938 -0.437370 -0.210163 0.150654 -0.213455 0.138204 0.226962 -0.210376 0.138589 -0.163267 0.149819 -0.413598 0.150927 0.150275 0.151355 0.151339 -0.221006 0.146310 -0.118314 0.143312 -0.104003 0.144519 -0.113938 0.142988 -0.221321 0.140308
charge: 0.768747 -0.390300 -0.354375 0.259270 -0.293280 -0.080171 -0.276131 -0.114952 0.164182 -0.097941 0.162814 -0.150164 -0.101336 0.161981 -0.114211 0.161810 -0.252807 0.138073 0.141225 0.145735 -0.132327 -0.083811 0.162332 -0.131136 0.158574 -0.119062 0.158070 -0.131078 0.158507 -0.080512 0.162272
qa: 0.6283 0.2345 -0.3680 -0.0792 0.1645 -0.2789 -0.4374 -0.2102 0.1507 -0.2135 0.1382 0.2270 -0.2104 0.1386 -0.1633 0.1498 -0.4136 0.1509 0.1503 0.1514 0.1513 -0.2210 0.1463 -0.1183 0.1433 -0.1040 0.1445 -0.1139 0.1430 -0.2213 0.1403
va: 5.6979 4.1048 2.5370 2.3134 3.6286 2.9942 2.0674 3.9417 0.9708 3.8514 0.9644 3.6845 3.9130 0.9651 3.9283 0.9864 3.8619 0.9695 0.9667 0.9635 3.5377 3.9542 0.9790 3.9121 0.9619 3.9317 0.9598 3.9032 0.9619 3.9726 0.9906
energy: -1197.242283591380 hartree
dipole: 4.144527379 -2.936191121 1.208336258 -11.471697290 9.119001530 -2.352695760 -7.699541633 7.456343173 -0.243198460
dipolemethod: SCF
magnitude: 2.656011924 au
magnitude: 6.751045797 debye
temp: 298.15 k
press: 1.00 atm
zeropoint: 0.23374783 hartree
thermalvibcorrection: 0.01341084 hartree
thermalrotcorrection: 0.00141627 hartree
thermaltrasncorrection: 0.00141627 hartree
thermaltotal: -1196.99229237 hartree
thermalcorr: 0.01624339 hartree
nonthermalcorr: 0.23374783 hartree
totalcorr: 0.24999122 hartree
thermalcorrenthalpy: 0.00094421 hartree
totalenthalpy: -1196.99134817 hartree
vibrat: 0.02376039 hartree
rotat: 0.01612060 hartree
transl: 0.02029008 hartree
total: 0.06017107 hartree
totalentropycorr: -0.06017107 hartree
gibbsenthalpy: -1197.05151924 hartree
gibbsminuselec: 0.19076435 hartree
