program: Orca
programVersion: 6.1.0
elementType: S S C N O C H H N C H H N O C H H C H H C C H C H C C H C H C H H H
charge: 0
multiplicity: 1
keywords: O3LYP DEF2-TZVP CPCM(DMSO) def2/j verytightscf rijcosx DefGrid3 FREQ
frequency: 0.00 0.00 0.00 0.00 0.00 0.00 17.36 23.16 28.78 48.01 56.83 85.97 119.57 135.12 178.46 199.35 232.89 245.83 264.87 302.93 309.99 327.89 371.47 393.47 409.24 409.61 442.92 483.76 485.91 513.25 524.54 570.60 600.60 634.93 638.55 679.45 695.20 723.87 764.96 817.22 826.95 839.22 841.23 850.42 888.68 929.40 968.88 970.35 979.96 996.08 997.68 1028.73 1029.96 1042.88 1050.46 1075.29 1112.67 1122.58 1123.85 1151.20 1186.44 1221.48 1231.09 1237.91 1244.14 1262.13 1293.16 1309.38 1318.54 1344.06 1357.33 1370.79 1376.67 1378.57 1401.05 1405.78 1420.58 1437.63 1442.36 1448.69 1454.07 1454.88 1464.48 1517.23 1612.07 1619.79 1642.73 2993.97 2996.34 3022.85 3025.47 3035.46 3095.60 3100.25 3110.08 3111.94 3134.63 3147.16 3176.49 3179.92 3201.79 3213.86
frequency: 17.36 23.16 28.78 48.01 56.83 85.97 119.57 135.12 178.46 199.35 232.89 245.83 264.87 302.93 309.99 327.89 371.47 393.47 409.24 409.61 442.92 483.76 485.91 513.25 524.54 570.60 600.60 634.93 638.55 679.45 695.20 723.87 764.96 817.22 826.95 839.22 841.23 850.42 888.68 929.40 968.88 970.35 979.96 996.08 997.68 1028.73 1029.96 1042.88 1050.46 1075.29 1112.67 1122.58 1123.85 1151.20 1186.44 1221.48 1231.09 1237.91 1244.14 1262.13 1293.16 1309.38 1318.54 1344.06 1357.33 1370.79 1376.67 1378.57 1401.05 1405.78 1420.58 1437.63 1442.36 1448.69 1454.07 1454.88 1464.48 1517.23 1612.07 1619.79 1642.73 2993.97 2996.34 3022.85 3025.47 3035.46 3095.60 3100.25 3110.08 3111.94 3134.63 3147.16 3176.49 3179.92 3201.79 3213.86
formula: C12H15N3O2S2
InChI: InChI=1/C12H15N3O2S2/c1-10-2-4-11(5-3-10)19(16)13-12(18-14-19)15-6-8-17-9-7-15/h2-5H,6-9H2,1H3
34 atoms
S  5.567666 5.227836 3.497355
S  4.740975 3.752903 5.540864
C  6.446238 3.685723 5.146729
N  4.305006 4.635302 4.190663
O  5.812874 6.649615 3.573875
C  6.874688 2.290792 7.082779
H  5.802322 2.090532 7.037391
H  7.072636 2.919178 7.958383
N  6.805889 4.387345 4.094842
C  7.612674 0.976155 7.204804
H  7.391687 0.521524 8.170953
H  7.28465 0.293374 6.409054
N  7.296099 2.981876 5.884535
O  9.006528 1.158532 7.13549
C  9.368054 1.729208 5.898054
H  9.072576 1.05929 5.078995
H  10.453795 1.830712 5.89393
C  8.731955 3.085075 5.706972
H  9.132749 3.792555 6.442405
H  8.942449 3.464779 4.709947
C  5.456774 4.835955 1.789543
C  5.816131 5.776948 0.839298
H  6.146075 6.759665 1.148712
C  5.745073 5.444508 -0.501959
H  6.026946 6.180798 -1.24631
C  5.318763 4.186077 -0.911831
C  4.964872 3.256834 0.066342
H  4.631102 2.268965 -0.231703
C  5.02955 3.571526 1.407602
H  4.745626 2.843244 2.157049
C  5.221509 3.838544 -2.358114
H  4.175821 3.820142 -2.678397
H  5.630709 2.845786 -2.553595
H  5.747515 4.562812 -2.979277
elementType: S C N O H
totalener: -1575.68395348275749 hartree
nucrepener: 1765.83730396265378 hartree
electener: -3341.49335885589335 hartree
oneelecener: -5673.48044907716576 hartree
twoeener: 2331.98709022127241 hartree
cpcmener: -0.02789830438577 hartree
kineticenergy: 1571.81139087975862 hartree
exchangeener: -134.053411141730 hartree
correlationener: -6.564616667508 hartree
xcener: -140.618027809238 hartree
energy: -2411.6264 -2408.0003 -515.9595 -515.3662 -386.8750 -385.5441 -385.3224 -276.3123 -274.3963 -274.3564 -274.2465 -274.0885 -274.0789 -273.7727 -273.6046 -273.5909 -273.3277 -273.3156 -272.8507 -217.5726 -214.5942 -162.9149 -162.8278 -162.8073 -159.9523 -159.7985 -159.6557 -29.0187 -27.9890 -26.7079 -25.4100 -23.4131 -23.2178 -21.3673 -20.9099 -20.4685 -20.0413 -19.1931 -18.4409 -17.9024 -16.7459 -16.4376 -16.3469 -15.4397 -15.0065 -14.3382 -14.2601 -13.0951 -12.8696 -12.7617 -12.5944 -12.3970 -12.2164 -12.1533 -11.8626 -11.6533 -11.2749 -11.1279 -11.0074 -10.5944 -10.3352 -10.0615 -9.9775 -9.8880 -9.5539 -9.4831 -9.3351 -9.0346 -8.7619 -8.4961 -8.3708 -8.1685 -7.7732 -7.3372 -7.1344 -6.9336 -6.5273 -5.5159 -1.7074 -1.0191 -0.5997 -0.5110 0.9334 1.0440 1.2890 1.4312 1.5105 1.6062 1.7644 electronvolt
chargesum: -0.0000000
charge: 0.622802 0.029649 0.071993 -0.437231 -0.460720 -0.133716 0.140535 0.120340 -0.330358 -0.080274 0.140384 0.100393 0.045346 -0.290048 -0.082759 0.100073 0.139344 -0.115217 0.112223 0.147028 0.160299 -0.168902 0.144377 -0.215786 0.135051 0.225209 -0.215754 0.134284 -0.216302 0.144854 -0.412585 0.148487 0.147892 0.149090
charge: 0.720569 0.523596 -0.591854 -0.513619 -0.295117 -0.258873 0.151947 0.147943 -0.131557 -0.325864 0.143437 0.133044 0.211403 0.163858 -0.325625 0.132521 0.143047 -0.243977 0.147582 0.155319 -0.286230 -0.122007 0.159712 -0.106965 0.160264 -0.157098 -0.102870 0.161174 -0.121674 0.162250 -0.255527 0.143770 0.140453 0.136969
qa: 0.6228 0.0296 0.0720 -0.4372 -0.4607 -0.1337 0.1405 0.1203 -0.3304 -0.0803 0.1404 0.1004 0.0453 -0.2900 -0.0828 0.1001 0.1393 -0.1152 0.1122 0.1470 0.1603 -0.1689 0.1444 -0.2158 0.1351 0.2252 -0.2158 0.1343 -0.2163 0.1449 -0.4126 0.1485 0.1479 0.1491
va: 5.8270 2.6661 4.3047 2.6996 2.0415 3.9856 0.9818 0.9804 2.9123 4.1045 0.9566 0.9824 3.3080 2.0580 4.1176 0.9808 0.9564 3.8988 0.9836 0.9935 3.6148 3.9293 0.9889 3.9190 0.9658 3.6760 3.8534 0.9649 3.9551 0.9701 3.8618 0.9637 0.9667 0.9705
energy: -1575.683953482757 hartree
dipole: 8.564715436 -7.488134938 1.076580498 -11.485167339 8.959639334 -2.525528006 -8.669536959 7.974691806 -0.694845153
dipolemethod: SCF
magnitude: 2.831982885 au
magnitude: 7.198328433 debye
temp: 298.15 k
press: 1.00 atm
zeropoint: 0.26554750 hartree
thermalvibcorrection: 0.01489445 hartree
thermalrotcorrection: 0.00141627 hartree
thermaltrasncorrection: 0.00141627 hartree
thermaltotal: -1575.40067899 hartree
thermalcorr: 0.01772699 hartree
nonthermalcorr: 0.26554750 hartree
totalcorr: 0.28327449 hartree
thermalcorrenthalpy: 0.00094421 hartree
totalenthalpy: -1575.39973478 hartree
vibrat: 0.02667482 hartree
rotat: 0.01629039 hartree
transl: 0.02041480 hartree
total: 0.06338001 hartree
totalentropycorr: -0.06338001 hartree
gibbsenthalpy: -1575.46311480 hartree
gibbsminuselec: 0.22083869 hartree
