program: Orca
programVersion: 6.1.0
elementType: S S N O C N O C H H N O C H H O C H H C H H C C H C H C C H C H C H H H
charge: 0
multiplicity: 1
keywords: B97 DEF2-TZVP CPCM(DMSO) def2/j verytightscf rijcosx DefGrid3 FREQ
frequency: 0.00 0.00 0.00 0.00 0.00 0.00 15.68 22.44 25.17 34.68 55.48 58.73 102.39 120.54 154.43 178.78 209.08 226.34 237.93 258.29 303.54 307.02 326.21 328.42 366.38 394.66 408.11 414.84 438.96 446.22 477.60 486.02 511.11 530.28 534.26 588.36 613.60 637.60 644.93 662.74 676.95 716.48 788.73 812.89 823.24 841.79 842.67 844.33 863.21 897.34 949.38 975.19 979.97 1004.33 1008.07 1012.10 1031.64 1038.05 1053.19 1077.09 1093.45 1120.12 1127.58 1133.46 1158.81 1190.06 1197.76 1223.15 1237.10 1261.19 1281.76 1290.14 1309.80 1322.27 1325.72 1329.66 1355.17 1368.76 1380.26 1394.42 1402.27 1417.82 1424.57 1461.57 1462.82 1469.58 1471.02 1475.09 1484.19 1513.06 1597.79 1618.79 1645.19 2993.91 2995.69 3023.27 3048.38 3050.97 3081.07 3103.07 3104.64 3113.88 3148.46 3153.52 3170.39 3173.86 3194.74 3206.06
frequency: 15.68 22.44 25.17 34.68 55.48 58.73 102.39 120.54 154.43 178.78 209.08 226.34 237.93 258.29 303.54 307.02 326.21 328.42 366.38 394.66 408.11 414.84 438.96 446.22 477.60 486.02 511.11 530.28 534.26 588.36 613.60 637.60 644.93 662.74 676.95 716.48 788.73 812.89 823.24 841.79 842.67 844.33 863.21 897.34 949.38 975.19 979.97 1004.33 1008.07 1012.10 1031.64 1038.05 1053.19 1077.09 1093.45 1120.12 1127.58 1133.46 1158.81 1190.06 1197.76 1223.15 1237.10 1261.19 1281.76 1290.14 1309.80 1322.27 1325.72 1329.66 1355.17 1368.76 1380.26 1394.42 1402.27 1417.82 1424.57 1461.57 1462.82 1469.58 1471.02 1475.09 1484.19 1513.06 1597.79 1618.79 1645.19 2993.91 2995.69 3023.27 3048.38 3050.97 3081.07 3103.07 3104.64 3113.88 3148.46 3153.52 3170.39 3173.86 3194.74 3206.06
formula: C12H15N3O4S2
InChI: InChI=1/C12H15N3O4S2/c1-10-2-4-11(5-3-10)20(16)13-12(21(17,18)14-20)15-6-8-19-9-7-15/h2-5H,6-9H2,1H3
36 atoms
S  0.15357 13.219391 6.507825
S  0.944329 15.387817 7.814111
N  1.094088 13.798646 7.627344
O  -0.783274 12.207483 6.922555
C  -0.293752 15.624345 6.434839
N  -0.622835 14.498307 5.85021
O  0.318986 15.732686 9.069116
C  -1.775844 16.982665 5.060611
H  -2.719129 17.281554 5.52922
H  -1.915257 16.036209 4.542024
N  -0.777581 16.809207 6.132368
O  2.170736 16.080117 7.492349
C  -1.296536 18.064883 4.094308
H  -0.400141 17.7180 3.561039
H  -2.083717 18.274214 3.367537
O  -1.019184 19.282178 4.77428
C  -0.004586 19.100363 5.75228
H  0.151328 20.065471 6.237867
H  0.932275 18.784787 5.271556
C  -0.419434 18.069537 6.802641
H  0.393135 17.914487 7.508868
H  -1.301373 18.420445 7.347828
C  1.16823 12.542973 5.226069
C  2.399571 13.129401 4.921798
H  2.763378 13.979035 5.487804
C  3.159172 12.599557 3.887344
H  4.117785 13.050704 3.651112
C  2.712542 11.492424 3.148563
C  1.474245 10.927841 3.476291
H  1.110178 10.071623 2.917674
C  0.696554 11.442617 4.510164
H  -0.257989 10.994134 4.756519
C  3.561289 10.918999 2.043615
H  3.945417 11.710989 1.394682
H  2.996282 10.209423 1.436305
H  4.427518 10.394199 2.461451
elementType: S N O C H
totalener: -1727.74711704044057 hartree
nucrepener: 2142.19413555117035 hartree
electener: -3869.90774606947798 hartree
oneelecener: -6628.50417783196372 hartree
twoeener: 2758.59643176248574 hartree
cpcmener: -0.03351219477462 hartree
kineticenergy: 1722.23955900314854 hartree
xcener: -144.147769970692 hartree
energy: -2422.3225 -2422.3032 -520.5500 -520.4671 -520.3496 -520.3406 -391.4829 -390.0570 -389.7098 -280.2661 -277.9899 -277.9844 -277.9248 -277.8340 -277.8229 -277.3589 -277.2661 -277.2622 -276.9238 -276.9128 -276.3798 -221.0178 -220.9243 -165.4611 -165.3691 -165.3592 -165.3569 -165.2806 -165.2677 -31.1250 -30.2559 -28.7785 -27.8750 -27.7588 -26.5729 -24.7559 -24.0447 -22.0254 -21.6409 -21.0788 -20.8687 -19.9625 -18.8714 -18.6606 -17.5514 -17.3021 -17.0562 -16.3742 -16.2096 -15.2797 -15.0278 -14.1808 -13.6489 -13.3848 -13.3611 -13.1696 -13.0987 -13.0184 -12.9069 -12.8138 -12.3870 -12.2519 -11.9084 -11.5815 -11.3600 -11.2564 -10.9386 -10.6336 -10.5984 -10.4234 -10.3576 -10.1973 -10.0836 -9.9437 -9.7209 -9.6217 -9.3226 -9.1634 -9.1477 -8.8696 -8.3272 -8.0838 -7.8002 -7.4698 -7.4032 -6.9214 -1.7018 -1.0304 -0.8403 0.5888 1.0174 1.1251 1.4407 1.5976 1.7813 1.8327 2.0199 electronvolt
chargesum: 0.0000000
charge: 0.726293 0.775627 -0.437550 -0.466688 0.094346 -0.343531 -0.476156 -0.123754 0.137447 0.158098 0.016191 -0.469868 -0.055657 0.111464 0.139570 -0.335575 -0.042846 0.140095 0.107223 -0.138648 0.150032 0.137412 0.129171 -0.175450 0.149288 -0.213720 0.147630 0.201830 -0.206389 0.148537 -0.183099 0.160727 -0.393485 0.143643 0.143096 0.144698
charge: 0.799821 0.594441 -0.414707 -0.273554 -0.419753 -0.121487 -0.303084 -0.208468 0.150113 0.152190 0.235757 -0.304310 -0.299602 0.130758 0.140748 0.140723 -0.299447 0.141022 0.130253 -0.222591 0.146043 0.149720 -0.278480 -0.113632 0.157097 -0.095200 0.159128 -0.141418 -0.099835 0.158166 -0.112619 0.158835 -0.244113 0.136112 0.132470 0.138901
qa: 0.7263 0.7756 -0.4376 -0.4667 0.0943 -0.3435 -0.4762 -0.1238 0.1374 0.1581 0.0162 -0.4699 -0.0557 0.1115 0.1396 -0.3356 -0.0428 0.1401 0.1072 -0.1386 0.1500 0.1374 0.1292 -0.1754 0.1493 -0.2137 0.1476 0.2018 -0.2064 0.1485 -0.1831 0.1607 -0.3935 0.1436 0.1431 0.1447
va: 5.7007 5.9002 2.7486 2.0458 4.0696 2.8972 2.0067 3.8523 0.9767 0.9861 3.3513 1.9943 4.0402 0.9746 0.9587 2.0008 4.0047 0.9589 0.9812 3.9021 1.0005 0.9752 3.6406 3.9017 0.9908 3.8695 0.9657 3.6604 3.9200 0.9653 3.9339 0.9787 3.8599 0.9644 0.9698 0.9623
energy: -1727.747117040441 hartree
dipole: 3.219992231 -3.225919226 -0.005926995 4.269131617 -3.566135490 0.702996128 -20.462809229 16.557617057 -3.905192172
dipolemethod: SCF
magnitude: 3.967967312 au
magnitude: 10.085771377 debye
temp: 298.15 k
press: 1.00 atm
zeropoint: 0.27443670 hartree
thermalvibcorrection: 0.01660105 hartree
thermalrotcorrection: 0.00141627 hartree
thermaltrasncorrection: 0.00141627 hartree
thermaltotal: -1727.45324675 hartree
thermalcorr: 0.01943359 hartree
nonthermalcorr: 0.27443670 hartree
totalcorr: 0.29387029 hartree
thermalcorrenthalpy: 0.00094421 hartree
totalenthalpy: -1727.45230254 hartree
vibrat: 0.02978870 hartree
rotat: 0.01647253 hartree
transl: 0.02055954 hartree
total: 0.06682076 hartree
totalentropycorr: -0.06682076 hartree
gibbsenthalpy: -1727.51912330 hartree
gibbsminuselec: 0.22799374 hartree
