program: Orca
programVersion: 6.1.0
elementType: S S C N O C H H N O C H H N O C H H C H H C C H C H C C H C H C H H H
charge: 0
multiplicity: 1
keywords: M06 DEF2-TZVP CPCM(DMSO) def2/j verytightscf rijcosx DefGrid3 FREQ
frequency: 0.00 0.00 0.00 0.00 0.00 0.00 27.58 35.12 41.80 46.86 63.04 86.21 109.53 127.58 168.35 189.72 213.43 240.28 268.99 284.02 316.45 328.74 339.74 357.61 378.53 411.01 412.47 431.30 436.11 479.72 507.24 515.43 533.42 577.23 619.97 626.74 638.87 669.43 684.55 723.46 800.05 814.40 827.78 836.45 843.33 856.45 886.10 912.38 962.77 982.90 992.30 997.97 1001.51 1023.90 1028.99 1044.01 1049.95 1074.83 1112.87 1124.19 1127.09 1132.49 1162.39 1188.23 1204.77 1231.67 1241.50 1254.08 1285.85 1305.25 1314.44 1316.52 1342.13 1348.15 1360.36 1374.61 1392.03 1402.09 1423.46 1424.78 1437.31 1445.29 1447.88 1454.55 1459.58 1464.49 1522.38 1625.67 1649.72 1661.18 2986.09 2987.86 3034.13 3040.99 3041.91 3102.10 3104.56 3107.26 3131.07 3131.86 3145.92 3149.27 3169.02 3171.09 3200.52
frequency: 27.58 35.12 41.80 46.86 63.04 86.21 109.53 127.58 168.35 189.72 213.43 240.28 268.99 284.02 316.45 328.74 339.74 357.61 378.53 411.01 412.47 431.30 436.11 479.72 507.24 515.43 533.42 577.23 619.97 626.74 638.87 669.43 684.55 723.46 800.05 814.40 827.78 836.45 843.33 856.45 886.10 912.38 962.77 982.90 992.30 997.97 1001.51 1023.90 1028.99 1044.01 1049.95 1074.83 1112.87 1124.19 1127.09 1132.49 1162.39 1188.23 1204.77 1231.67 1241.50 1254.08 1285.85 1305.25 1314.44 1316.52 1342.13 1348.15 1360.36 1374.61 1392.03 1402.09 1423.46 1424.78 1437.31 1445.29 1447.88 1454.55 1459.58 1464.49 1522.38 1625.67 1649.72 1661.18 2986.09 2987.86 3034.13 3040.99 3041.91 3102.10 3104.56 3107.26 3131.07 3131.86 3145.92 3149.27 3169.02 3171.09 3200.52
formula: C12H15N3O3S2
InChI: InChI=1/C12H15N3O3S2/c1-10-2-4-11(5-3-10)20(17)13-12(19(16)14-20)15-6-8-18-9-7-15/h2-5H,6-9H2,1H3
35 atoms
S  3.169594 8.288045 18.441351
S  3.964369 5.726756 18.737421
C  5.172379 7.143263 19.174154
N  2.743369 6.781428 18.523289
O  2.360972 9.181157 19.215824
C  6.860306 5.508113 19.885443
H  7.577773 5.226253 19.107879
H  6.034998 4.797472 19.871902
N  4.726643 8.329975 18.896833
O  4.53392 5.260681 17.455449
C  7.527601 5.495518 21.241824
H  6.778258 5.689117 22.023431
H  7.972623 4.516371 21.422657
N  6.378609 6.857437 19.596586
O  8.557014 6.453243 21.313488
C  8.043563 7.751351 21.12126
H  8.874054 8.452459 21.212599
H  7.304372 7.981954 21.902244
C  7.406933 7.889072 19.758861
H  6.950908 8.869002 19.633643
H  8.157414 7.741923 18.975231
C  3.159345 8.854169 16.77627
C  2.650831 10.107433 16.481734
H  2.251037 10.733653 17.269286
C  2.662013 10.542867 15.168149
H  2.265381 11.523399 14.927383
C  3.173615 9.745472 14.151747
C  3.6829 8.489037 14.480256
H  4.085558 7.858708 13.694058
C  3.677694 8.035689 15.782015
H  4.067277 7.051892 16.031016
C  3.164608 10.203939 12.732171
H  4.125248 10.010138 12.250917
H  2.943148 11.268564 12.656507
H  2.406985 9.662138 12.159408
elementType: S C N O H
totalener: -1652.31332333400792 hartree
nucrepener: 1956.04921114097215 hartree
electener: -3608.33288217004929 hartree
oneelecener: -6155.15517143226771 hartree
twoeener: 2546.82228926221842 hartree
cpcmener: -0.02965758822801 hartree
kineticenergy: 1646.94476839313802 hartree
xcener: -124.690637648746 hartree
energy: -2428.4582 -2426.5141 -523.2663 -523.0055 -522.3607 -393.5543 -392.1305 -391.6738 -281.9461 -280.1299 -280.1119 -280.0192 -279.8760 -279.6310 -279.3391 -279.2214 -279.1685 -278.8818 -278.8690 -278.4448 -223.9607 -222.2654 -167.3116 -167.2117 -167.1924 -165.5908 -165.5549 -165.3744 -30.9837 -29.5859 -29.3993 -27.9834 -26.7979 -24.8987 -24.3861 -22.3385 -22.0165 -21.3642 -21.1295 -20.2760 -19.2734 -18.9300 -17.8250 -17.4672 -17.3336 -16.4885 -16.1162 -15.4834 -15.2249 -14.3285 -13.8579 -13.7432 -13.6707 -13.4977 -13.2763 -13.1642 -13.0465 -12.7984 -12.5876 -12.2379 -11.9912 -11.9444 -11.5842 -11.3598 -10.9636 -10.8890 -10.6993 -10.6697 -10.4682 -10.4327 -10.1930 -9.8755 -9.5488 -9.4203 -9.0426 -8.9074 -8.5027 -8.3624 -7.7634 -7.7411 -7.4122 -7.1879 -1.4020 -0.7747 -0.6245 0.0362 1.0202 1.2326 1.3855 1.5784 1.6812 1.7605 1.9519 electronvolt
chargesum: 0.0000000
charge: 0.808614 0.535657 0.331032 -0.479672 -0.499408 -0.141722 0.153998 0.145476 -0.449229 -0.564116 0.008540 0.115309 0.120242 -0.191716 -0.412105 -0.007636 0.119177 0.119152 -0.107139 0.147583 0.143217 -0.023620 -0.090893 0.153179 -0.190899 0.130385 0.103133 -0.233957 0.132455 -0.138963 0.164238 -0.260002 0.121623 0.108619 0.129448
charge: 0.793570 0.641491 -0.451938 -0.496904 -0.282089 -0.229187 0.147427 0.143851 -0.128390 -0.427050 -0.302554 0.128678 0.138945 0.217644 0.145397 -0.302528 0.138610 0.128654 -0.211453 0.150453 0.147644 -0.291239 -0.111518 0.156085 -0.100775 0.154695 -0.152071 -0.096124 0.155850 -0.118657 0.148797 -0.233371 0.132876 0.128559 0.136623
qa: 0.8086 0.5357 0.3310 -0.4797 -0.4994 -0.1417 0.1540 0.1455 -0.4492 -0.5641 0.0085 0.1153 0.1202 -0.1917 -0.4121 -0.0076 0.1192 0.1192 -0.1071 0.1476 0.1432 -0.0236 -0.0909 0.1532 -0.1909 0.1304 0.1031 -0.2340 0.1325 -0.1390 0.1642 -0.2600 0.1216 0.1086 0.1294
va: 5.5056 3.8092 3.8254 2.6305 1.9511 3.7060 0.9657 0.9791 2.8135 1.7971 3.7692 0.9797 0.9717 3.1731 1.8194 3.7924 0.9722 0.9748 3.6349 0.9886 0.9727 3.7306 3.8876 0.9833 3.9017 0.9771 3.6499 3.9827 0.9820 3.8871 1.0264 3.7819 0.9589 0.9741 0.9525
energy: -1652.313323334008 hartree
dipole: 12.197499228 -9.954783519 2.242715709 5.571254173 -4.919271265 0.651982908 -7.556183966 7.187974685 -0.368209281
dipolemethod: SCF
magnitude: 2.364409765 au
magnitude: 6.009852012 debye
temp: 298.15 k
press: 1.00 atm
zeropoint: 0.27011598 hartree
thermalvibcorrection: 0.01558783 hartree
thermalrotcorrection: 0.00141627 hartree
thermaltrasncorrection: 0.00141627 hartree
thermaltotal: -1652.02478697 hartree
thermalcorr: 0.01842038 hartree
nonthermalcorr: 0.27011598 hartree
totalcorr: 0.28853636 hartree
thermalcorrenthalpy: 0.00094421 hartree
totalenthalpy: -1652.02384276 hartree
vibrat: 0.02739345 hartree
rotat: 0.01633526 hartree
transl: 0.02048902 hartree
total: 0.06421773 hartree
totalentropycorr: -0.06421773 hartree
gibbsenthalpy: -1652.08806049 hartree
gibbsminuselec: 0.22526284 hartree
