program: Orca
programVersion: 6.1.0
elementType: S S O N C C N C H N H C H C C H C H C H H H C C H H H C H H H C H H H
charge: 0
multiplicity: 1
keywords: PBE DEF2-TZVP CPCM(DMSO) def2/j verytightscf rijcosx DefGrid3 FREQ
frequency: 0.00 0.00 0.00 0.00 0.00 0.00 22.88 23.88 28.09 31.31 69.42 76.24 100.40 135.58 175.79 201.02 211.64 234.62 251.12 259.79 264.82 286.85 294.96 309.79 331.74 366.19 378.53 397.15 398.97 407.78 440.41 463.50 467.94 493.82 537.07 566.53 593.48 622.45 664.58 685.95 699.31 714.25 747.41 796.54 801.22 815.68 883.15 901.54 907.12 910.71 919.54 932.52 940.41 940.99 974.21 1002.29 1012.86 1017.63 1027.31 1069.79 1097.59 1158.67 1163.31 1174.01 1188.15 1203.05 1203.64 1233.50 1279.40 1332.98 1336.33 1336.97 1348.29 1358.00 1383.40 1410.31 1412.33 1420.65 1421.42 1425.60 1426.62 1433.63 1446.02 1471.59 1479.81 1537.61 1564.80 1584.25 2968.79 2970.05 2974.19 2978.88 3026.61 3039.85 3048.21 3050.07 3061.87 3063.01 3063.17 3065.72 3105.09 3107.31 3129.96 3140.15 3502.12
frequency: 22.88 23.88 28.09 31.31 69.42 76.24 100.40 135.58 175.79 201.02 211.64 234.62 251.12 259.79 264.82 286.85 294.96 309.79 331.74 366.19 378.53 397.15 398.97 407.78 440.41 463.50 467.94 493.82 537.07 566.53 593.48 622.45 664.58 685.95 699.31 714.25 747.41 796.54 801.22 815.68 883.15 901.54 907.12 910.71 919.54 932.52 940.41 940.99 974.21 1002.29 1012.86 1017.63 1027.31 1069.79 1097.59 1158.67 1163.31 1174.01 1188.15 1203.05 1203.64 1233.50 1279.40 1332.98 1336.33 1336.97 1348.29 1358.00 1383.40 1410.31 1412.33 1420.65 1421.42 1425.60 1426.62 1433.63 1446.02 1471.59 1479.81 1537.61 1564.80 1584.25 2968.79 2970.05 2974.19 2978.88 3026.61 3039.85 3048.21 3050.07 3061.87 3063.01 3063.17 3065.72 3105.09 3107.31 3129.96 3140.15 3502.12
formula: C12H17N3OS2
InChI: InChI=1/C12H17N3OS2/c1-9-5-7-10(8-6-9)18(16)14-11(17-15-18)13-12(2,3)4/h5-8,13H,1-4H3
35 atoms
S  4.563186 3.343904 -13.402245
S  5.586848 3.985022 -15.786176
O  4.350484 1.944621 -13.011386
N  4.170192 3.845676 -14.852185
C  6.700277 4.009867 -14.393938
C  3.632635 4.341455 -12.26519
N  6.144701 3.758466 -13.216824
C  3.042889 3.745454 -11.148091
H  3.137291 2.671419 -10.989328
N  8.002713 4.24355 -14.594057
H  8.278573 4.47816 -15.544819
C  2.334091 4.543054 -10.247936
H  1.871602 4.080305 -9.373391
C  2.204437 5.925785 -10.446216
C  2.809746 6.498103 -11.580815
H  2.720161 7.573017 -11.753403
C  3.520257 5.71949 -12.489073
H  3.98206 6.171348 -13.367765
C  1.431471 6.780506 -9.480897
H  1.125481 6.209069 -8.595289
H  2.029461 7.643811 -9.152963
H  0.52484 7.183998 -9.958681
C  9.111777 4.131544 -13.602273
C  9.172607 2.705136 -13.036478
H  9.318642 1.97505 -13.845449
H  10.019635 2.62653 -12.340406
H  8.253741 2.452306 -12.492149
C  8.92335 5.164017 -12.480708
H  8.00195 4.974451 -11.915596
H  9.774196 5.106052 -11.787065
H  8.882143 6.181271 -12.895762
C  10.395156 4.439307 -14.382385
H  10.361326 5.452717 -14.809666
H  11.258231 4.379028 -13.706793
H  10.543074 3.715166 -15.197495
elementType: S O N C H
totalener: -1502.42868718216505 hartree
nucrepener: 1637.18793742503522 hartree
electener: -3139.58953129229758 hartree
oneelecener: -5314.64562670744908 hartree
twoeener: 2175.05609541515150 hartree
cpcmener: -0.02709331490291 hartree
kineticenergy: 1497.73483842879705 hartree
exchangeener: -145.928259984552 hartree
correlationener: -5.209702853325 hartree
xcener: -151.137962837877 hartree
energy: -2400.6728 -2397.0329 -510.1453 -381.7284 -380.8834 -380.7230 -272.0799 -270.5741 -270.0995 -269.7400 -269.5799 -269.5681 -269.3206 -269.3115 -268.8568 -268.7371 -268.5957 -268.5916 -212.8623 -209.8438 -159.0375 -158.9559 -158.9367 -156.0572 -155.9043 -155.7338 -27.1546 -24.7866 -23.5299 -21.8271 -21.7364 -20.2366 -19.7042 -18.8003 -18.6419 -17.1831 -17.1022 -16.9223 -15.8930 -15.4618 -15.2878 -14.5750 -13.7705 -13.2513 -12.9392 -12.0295 -11.7420 -11.4832 -11.2831 -11.0740 -10.8621 -10.5672 -10.4947 -10.3489 -10.2180 -10.0385 -9.4413 -9.3362 -9.2413 -9.1880 -9.1704 -8.7981 -8.7510 -8.5282 -8.3705 -8.2883 -8.1385 -7.9703 -7.5900 -7.4236 -6.9967 -6.6997 -6.6646 -6.2067 -4.9968 -2.2415 -1.5643 -1.2530 -1.0388 0.2726 0.5429 0.7871 1.0475 1.0992 1.2620 1.5548 electronvolt
chargesum: -0.0000000
charge: 0.589776 0.016953 -0.448804 -0.422482 0.151117 0.143087 -0.320062 -0.159048 0.147681 -0.189832 0.264059 -0.206695 0.139191 0.189529 -0.199893 0.137970 -0.215781 0.147717 -0.396900 0.145405 0.146749 0.147513 0.164083 -0.385137 0.127492 0.133823 0.133677 -0.384038 0.134497 0.132982 0.126856 -0.414453 0.142117 0.138568 0.142283
charge: 0.736933 0.494860 -0.301859 -0.514572 -0.610422 -0.282748 -0.131921 -0.122570 0.158627 0.183651 0.212642 -0.106025 0.159675 -0.151906 -0.100844 0.160803 -0.123271 0.160776 -0.256782 0.136332 0.141514 0.143250 -0.373507 -0.267491 0.130880 0.135735 0.127269 -0.267640 0.126970 0.135331 0.130465 -0.267793 0.132660 0.138380 0.132598
qa: 0.5898 0.0170 -0.4488 -0.4225 0.1511 0.1431 -0.3201 -0.1590 0.1477 -0.1898 0.2641 -0.2067 0.1392 0.1895 -0.1999 0.1380 -0.2158 0.1477 -0.3969 0.1454 0.1467 0.1475 0.1641 -0.3851 0.1275 0.1338 0.1337 -0.3840 0.1345 0.1330 0.1269 -0.4145 0.1421 0.1386 0.1423
va: 5.6939 2.6138 2.0409 2.7005 4.2344 3.5818 2.8851 3.9234 0.9893 3.2617 0.9368 3.9307 0.9667 3.6680 3.8612 0.9656 3.9638 0.9760 3.8568 0.9719 0.9643 0.9624 3.8947 3.8172 0.9821 0.9752 0.9977 3.8128 0.9959 0.9754 0.9824 3.8382 0.9741 0.9780 0.9740
energy: -1502.428687182165 hartree
dipole: 17.605947142 -15.696857771 1.909089372 9.525583617 -7.256713211 2.268870406 13.360410907 -12.585176633 0.775234274
dipolemethod: SCF
magnitude: 3.064862693 au
magnitude: 7.790261864 debye
temp: 298.15 k
press: 1.00 atm
zeropoint: 0.27095550 hartree
thermalvibcorrection: 0.01679505 hartree
thermalrotcorrection: 0.00141627 hartree
thermaltrasncorrection: 0.00141627 hartree
thermaltotal: -1502.13810409 hartree
thermalcorr: 0.01962759 hartree
nonthermalcorr: 0.27095550 hartree
totalcorr: 0.29058309 hartree
thermalcorrenthalpy: 0.00094421 hartree
totalenthalpy: -1502.13715989 hartree
vibrat: 0.02985592 hartree
rotat: 0.01615813 hartree
transl: 0.02034660 hartree
total: 0.06636064 hartree
totalentropycorr: -0.06636064 hartree
gibbsenthalpy: -1502.20352053 hartree
gibbsminuselec: 0.22516665 hartree
