program: Orca
programVersion: 6.1.0
elementType: S S C N O C H H N O C H H N O C H H C H H C C H C H C C H C H C H H H
charge: 0
multiplicity: 1
keywords: B97-D4 DEF2-TZVP CPCM(DMSO) def2/j verytightscf rijcosx DefGrid3 FREQ
frequency: 0.00 0.00 0.00 0.00 0.00 0.00 20.33 26.43 33.60 41.12 57.05 82.38 101.97 124.07 165.32 180.27 206.00 237.97 261.39 276.22 306.16 315.99 333.13 352.08 363.85 397.33 401.74 412.29 426.13 473.57 491.48 498.85 517.25 564.82 603.79 613.29 633.81 643.41 662.95 703.74 757.18 785.78 804.98 811.26 828.27 830.93 836.78 873.04 903.92 929.26 951.70 957.10 987.90 992.50 1015.06 1016.49 1034.33 1045.63 1052.28 1078.14 1086.38 1107.57 1124.45 1161.26 1187.76 1210.54 1214.12 1215.36 1234.17 1266.87 1297.21 1314.01 1331.50 1342.19 1343.91 1355.72 1371.04 1372.95 1394.95 1402.14 1435.22 1441.43 1441.89 1446.92 1449.38 1457.97 1497.17 1578.40 1597.10 1635.35 2943.93 2946.89 2978.68 3005.46 3008.56 3036.39 3058.35 3060.08 3070.25 3093.70 3105.02 3124.86 3129.98 3137.14 3166.53
frequency: 20.33 26.43 33.60 41.12 57.05 82.38 101.97 124.07 165.32 180.27 206.00 237.97 261.39 276.22 306.16 315.99 333.13 352.08 363.85 397.33 401.74 412.29 426.13 473.57 491.48 498.85 517.25 564.82 603.79 613.29 633.81 643.41 662.95 703.74 757.18 785.78 804.98 811.26 828.27 830.93 836.78 873.04 903.92 929.26 951.70 957.10 987.90 992.50 1015.06 1016.49 1034.33 1045.63 1052.28 1078.14 1086.38 1107.57 1124.45 1161.26 1187.76 1210.54 1214.12 1215.36 1234.17 1266.87 1297.21 1314.01 1331.50 1342.19 1343.91 1355.72 1371.04 1372.95 1394.95 1402.14 1435.22 1441.43 1441.89 1446.92 1449.38 1457.97 1497.17 1578.40 1597.10 1635.35 2943.93 2946.89 2978.68 3005.46 3008.56 3036.39 3058.35 3060.08 3070.25 3093.70 3105.02 3124.86 3129.98 3137.14 3166.53
formula: C12H15N3O3S2
InChI: InChI=1/C12H15N3O3S2/c1-10-2-4-11(5-3-10)20(17)13-12(19(16)14-20)15-6-8-18-9-7-15/h2-5H,6-9H2,1H3
35 atoms
S  3.177555 8.246498 18.436456
S  4.03377 5.683293 18.687214
C  5.219754 7.120796 19.141424
N  2.766585 6.717666 18.512078
O  2.349989 9.12835 19.235613
C  6.917005 5.497599 19.877989
H  7.69582 5.217746 19.159296
H  6.099541 4.778409 19.813731
N  4.749162 8.314227 18.888756
O  4.60238 5.230325 17.377131
C  7.481236 5.511884 21.296366
H  6.66907 5.705713 22.015031
H  7.937891 4.543869 21.52045
N  6.441945 6.843969 19.538549
O  8.505233 6.497627 21.437376
C  7.992289 7.803361 21.161959
H  8.821767 8.50444 21.290031
H  7.193368 8.052593 21.878017
C  7.455059 7.893815 19.737878
H  7.001166 8.866915 19.550675
H  8.261538 7.721974 19.015063
C  3.153353 8.828395 16.774317
C  2.717274 10.124163 16.50737
H  2.380538 10.766653 17.313539
C  2.722975 10.576259 15.190799
H  2.384944 11.58663 14.973923
C  3.156232 9.753614 14.144246
C  3.593232 8.455623 14.449221
H  3.934444 7.804018 13.648193
C  3.593146 7.984125 15.755468
H  3.928549 6.97607 15.982899
C  3.130122 10.235118 12.72089
H  4.008671 9.884954 12.168768
H  3.090976 11.327013 12.669479
H  2.24473 9.843978 12.20209
elementType: S C N O H
totalener: -1652.29379840894899 hartree
nucrepener: 1945.45340332189835 hartree
electener: -3597.71665750845523 hartree
oneelecener: -6135.25253459995201 hartree
twoeener: 2537.53587709149679 hartree
cpcmener: -0.03054422239229 hartree
kineticenergy: 1648.22256510420016 hartree
exchangeener: -160.944920610827 hartree
correlationener: -7.550214291530 hartree
xcener: -168.495134902356 hartree
energy: -2400.0930 -2398.2147 -510.7212 -510.5008 -509.8558 -382.8389 -381.4000 -380.9814 -272.5044 -270.9174 -270.9064 -270.8123 -270.6944 -270.5137 -270.1408 -270.0257 -269.9590 -269.7423 -269.7400 -269.3131 -214.3787 -212.7489 -160.8243 -160.7288 -160.7076 -159.1832 -159.1489 -158.9501 -27.7355 -26.3493 -26.1061 -25.1820 -23.9788 -22.2526 -21.8620 -19.9814 -19.7171 -19.1101 -18.8802 -18.0650 -17.1368 -16.8682 -15.8632 -15.5143 -15.3631 -14.5910 -14.1904 -13.5951 -13.3608 -12.4196 -12.0486 -11.9561 -11.8812 -11.6372 -11.5833 -11.4121 -11.2193 -11.0445 -10.8147 -10.5789 -10.3241 -10.2579 -9.9381 -9.6309 -9.4075 -9.3545 -9.1553 -8.9989 -8.9433 -8.8120 -8.5040 -8.3370 -7.8674 -7.8438 -7.5185 -7.3348 -6.9556 -6.7868 -6.5932 -6.3683 -5.9745 -5.8411 -2.2152 -1.6263 -1.4342 -0.9329 0.1640 0.7435 0.8285 0.9873 1.1686 1.2569 1.3395 electronvolt
chargesum: -0.0000000
charge: 0.740002 0.450496 0.106265 -0.457393 -0.468151 -0.107289 0.121526 0.137047 -0.366307 -0.535240 -0.036625 0.094295 0.128641 0.036232 -0.320921 -0.044073 0.128684 0.097454 -0.097121 0.141811 0.120556 0.095247 -0.160246 0.139074 -0.196178 0.126917 0.202574 -0.228713 0.125262 -0.133319 0.113835 -0.358357 0.134374 0.133932 0.135709
charge: 0.777948 0.610091 -0.463175 -0.485930 -0.275933 -0.228399 0.147491 0.144940 -0.120212 -0.415711 -0.297220 0.129404 0.139621 0.231592 0.139038 -0.296837 0.139442 0.129723 -0.211621 0.150857 0.148359 -0.287390 -0.116933 0.155616 -0.100214 0.155838 -0.147022 -0.097501 0.156328 -0.121272 0.148768 -0.244195 0.134223 0.131936 0.138350
qa: 0.7400 0.4505 0.1063 -0.4574 -0.4682 -0.1073 0.1215 0.1370 -0.3663 -0.5352 -0.0366 0.0943 0.1286 0.0362 -0.3209 -0.0441 0.1287 0.0975 -0.0971 0.1418 0.1206 0.0952 -0.1602 0.1391 -0.1962 0.1269 0.2026 -0.2287 0.1253 -0.1333 0.1138 -0.3584 0.1344 0.1339 0.1357
va: 5.6201 3.9192 4.0920 2.7218 2.0484 3.9465 0.9798 0.9916 2.9101 1.8851 4.0418 0.9806 0.9611 3.4061 2.0447 4.0684 0.9600 0.9761 3.8770 0.9952 0.9808 3.6636 3.9139 0.9840 3.9061 0.9688 3.6690 3.9083 0.9704 3.8349 1.0423 3.8518 0.9691 0.9724 0.9647
dispersion: -0.189096494 hartree
energy: -1652.482894903299 hartree
dipole: 11.912058088 -9.507840595 2.404217493 5.947973526 -5.174450177 0.773523350 -7.418930151 7.021128966 -0.397801185
dipolemethod: SCF
magnitude: 2.556725623 au
magnitude: 6.498680074 debye
temp: 298.15 k
press: 1.00 atm
zeropoint: 0.26473017 hartree
thermalvibcorrection: 0.01610485 hartree
thermalrotcorrection: 0.00141627 hartree
thermaltrasncorrection: 0.00141627 hartree
thermaltotal: -1652.19922734 hartree
thermalcorr: 0.01893739 hartree
nonthermalcorr: 0.26473017 hartree
totalcorr: 0.28366756 hartree
thermalcorrenthalpy: 0.00094421 hartree
totalenthalpy: -1652.19828313 hartree
vibrat: 0.02858659 hartree
rotat: 0.01634417 hartree
transl: 0.02048902 hartree
total: 0.06541977 hartree
totalentropycorr: -0.06541977 hartree
gibbsenthalpy: -1652.26370291 hartree
gibbsminuselec: 0.21919200 hartree
