program: Gaussian 09
title: 000076650
version: EM64L-G09RevD.01
frameworkgroup: C1[X(C3Cl6F2)]
method: RPBEPBE
basis: SDD
operation: Freq
keyword: #pfreq=noraman
keyword: PBEPBE/SDD
title: #p freq=noraman PBEPBE/SDD
converged: NO YES NO NO
title: Mulliken charges:
elementType: Cl Cl Cl Cl Cl Cl F F C C C
charge: 0.172523 0.166272 0.156928 0.172647 0.156451 0.166371 -0.125164 -0.125429 0.688232 -0.714532 -0.714301
chargesum: 0.00000
title: Mulliken charges with hydrogens summed into heavy atoms:
polarizability: 8.29458705e+01 -2.79768846e-02 8.85233970e+01 -3.88582135e-01 4.45993331e-02 9.47237831e+01
1716.lowfreq: -11.3519 -9.1440 -0.0020 0.0016 0.0018 7.8963 26.6307 72.0142 129.2506
frequency: 26.6290 71.9532 129.2506 161.3806 172.7139 176.8403 187.5167 241.4277 250.5350 264.8636 269.9782 277.9943 306.4021 325.4337 380.0455 381.3436 417.4625 530.7756 608.9175 726.4396 735.1915 759.4078 781.0786 842.1687 1013.8035 1049.7996 1055.7960
redmass: 34.3914 24.2229 30.9865 31.4922 30.9414 29.6951 33.5167 26.5485 29.1435 24.9574 29.9772 22.7064 26.3381 24.3683 30.0597 31.4423 20.4272 17.7091 13.8474 12.8154 12.7741 12.6745 12.9832 13.2691 13.0473 12.7827 12.0783
irintensity: 0.0166 0.2718 0.0912 0.0024 0.4822 0.8436 0.0028 0.0009 0.2655 0.0123 0.1224 1.0080 0.0648 0.4165 3.3920 0.0218 11.7243 22.6406 151.3598 3.5367 12.2402 189.6757 269.9309 56.0072 54.0260 24.6921 9.4400
temp: 298.150 k
press: 1.00000 atm
elementType: 17 17 17 17 17 17 9 9 6 6 6
symmnumber: 1
zpe: 72644.1 jmol-1
zpe.correction: 0.027669 hartree
zpe.thermalcorrener: 0.040268 hartree
zpe.thermalcorrenthalpy: 0.041213 hartree
zpe.thermalcorrgfe: -0.013088 hartree
zpe.sumelectzpe: -3073.452069 hartree
zpe.sumelectthermal: -3073.439469 hartree
zpe.sumelectthermalent: -3073.438525 hartree
zpe.sumelectthermalfe: -3073.492826 hartree
dipole: 0.0020 -1.0970 0.0026
dipole: 1.0970
quadrupole: -102.8690 -103.8827 -102.3615
quadrupole: 0.0106 0.0846 0.0087
quadrupole: 0.1687 -0.8450 0.6762 0.0106 0.0846 0.0087
hfenergy: -3073.4797377 hartree
pointgroup: C01 [X(C3Cl6F2)]
dipole: -0.0048197 -0.4309445 -0.0233641 debye
dipolederiv: -0.4295785 -0.3249373 -0.0996413 -0.2606193 -0.3799968 -0.0898742 -0.0970003 -0.0908177 -0.1226293 -0.1221988 0.0168807 0.0846284 -0.0001716 -0.1393574 -0.1724256 -0.000966 -0.1466727 -0.6041902 -0.1146467 0.0059391 -0.0151334 -0.0647518 -0.42488 0.2976411 0.0520151 0.2817097 -0.3449893 -0.417153 0.33422 -0.0635803 0.2698898 -0.4081935 0.0621598 -0.0681434 0.0635443 -0.1064992 -0.1138509 -0.0088697 -0.0212853 0.0546324 -0.3643096 -0.2993052 0.0533314 -0.2843924 -0.4069703 -0.1229058 -0.0272405 0.0874651 -0.0014468 -0.1783157 0.2169474 0.0042128 0.1922782 -0.5648289 -0.3983879 -0.020593 0.0078586 -0.002494 -0.4055516 -0.2724618 0.013472 -0.18722 -0.518718 -0.398279 0.0183514 0.0154126 0.0001047 -0.4583774 0.2792326 0.0173718 0.1933208 -0.4658128 0.8640662 0.0003705 -0.0407601 0.000335 0.656766 -0.0026655 -0.038785 -0.002894 0.7146912 0.6327019 0.4181184 0.0455975 0.2363255 1.0489452 -0.0330175 0.0446136 -0.0767168 1.2054977 0.6202327 -0.4122397 -0.0005618 -0.2318037 1.0532709 0.013769 0.019878 0.0578605 1.2144491 unknown
polarizability: 82.9397245|0.06336|88.5441797|0.2629181|-0.3698095|94.7091464 unknown
InChI: InChI=1S/C3Cl6F2/c4-2(5,6)1(10,11)3(7,8)9
charge 0 multiplicity 1
11 atoms
Cl 2.737226 0.984554 0.34113
Cl 1.690268 -0.824304 -1.802836
Cl 1.481167 -1.64758 1.096011
Cl -2.716168 1.068832 -0.236955
Cl -1.509992 -1.493751 -1.264494
Cl -1.712872 -0.979316 1.703789
F  0.038555 1.32691 1.215152
F  -0.009324 1.456248 -1.058127
C  0.005878 0.543297 0.030742
C  1.388927 -0.227754 -0.077125
C  -1.393664 -0.207236 0.052612
