program: Orca
programVersion: 6.1.0
elementType: S S O N C C N C H N H C H C C H C H C H H H C C H H H C H H H C H H H
charge: 0
multiplicity: 1
keywords: B97-D4 DEF2-TZVP CPCM(DMSO) def2/j verytightscf rijcosx DefGrid3 FREQ
frequency: 0.00 0.00 0.00 0.00 0.00 0.00 4.48 26.81 29.32 34.21 67.19 78.35 104.83 138.38 178.53 203.01 217.49 238.81 256.96 265.79 275.66 293.64 303.02 315.06 344.72 377.92 386.15 401.34 405.07 414.82 450.50 475.77 479.81 499.03 547.64 580.91 601.69 634.03 676.91 698.74 702.76 716.95 750.79 805.51 809.28 825.04 892.57 912.17 915.99 927.00 932.33 952.10 953.56 954.91 991.68 1017.06 1032.33 1035.35 1047.90 1090.27 1117.97 1172.15 1182.06 1192.92 1203.00 1210.94 1218.65 1247.02 1305.89 1344.28 1362.41 1366.31 1373.74 1388.54 1400.60 1437.88 1438.17 1448.98 1449.55 1450.08 1453.59 1461.91 1474.20 1494.74 1506.48 1558.21 1580.40 1597.91 2981.28 2983.22 2989.19 2994.90 3033.97 3050.88 3058.09 3059.99 3071.31 3075.56 3082.99 3085.58 3126.95 3130.71 3156.35 3168.92 3543.95
frequency: 4.48 26.81 29.32 34.21 67.19 78.35 104.83 138.38 178.53 203.01 217.49 238.81 256.96 265.79 275.66 293.64 303.02 315.06 344.72 377.92 386.15 401.34 405.07 414.82 450.50 475.77 479.81 499.03 547.64 580.91 601.69 634.03 676.91 698.74 702.76 716.95 750.79 805.51 809.28 825.04 892.57 912.17 915.99 927.00 932.33 952.10 953.56 954.91 991.68 1017.06 1032.33 1035.35 1047.90 1090.27 1117.97 1172.15 1182.06 1192.92 1203.00 1210.94 1218.65 1247.02 1305.89 1344.28 1362.41 1366.31 1373.74 1388.54 1400.60 1437.88 1438.17 1448.98 1449.55 1450.08 1453.59 1461.91 1474.20 1494.74 1506.48 1558.21 1580.40 1597.91 2981.28 2983.22 2989.19 2994.90 3033.97 3050.88 3058.09 3059.99 3071.31 3075.56 3082.99 3085.58 3126.95 3130.71 3156.35 3168.92 3543.95
formula: C12H17N3OS2
InChI: InChI=1/C12H17N3OS2/c1-9-5-7-10(8-6-9)18(16)14-11(17-15-18)13-12(2,3)4/h5-8,13H,1-4H3
35 atoms
S  4.567839 3.266979 -13.37974
S  5.546416 3.933311 -15.769389
O  4.368562 1.877664 -12.977062
N  4.149013 3.736615 -14.823605
C  6.669447 3.97422 -14.395631
C  3.667461 4.274553 -12.252682
N  6.134304 3.705032 -13.219447
C  2.997161 3.698261 -11.178615
H  3.014827 2.623072 -11.039237
N  7.958038 4.237116 -14.604336
H  8.226073 4.476693 -15.548854
C  2.307037 4.523368 -10.292773
H  1.779067 4.079316 -9.452481
C  2.283939 5.911104 -10.465662
C  2.974341 6.463319 -11.556935
H  2.96803 7.540749 -11.704566
C  3.662693 5.656422 -12.451214
H  4.19185 6.087542 -13.295182
C  1.532845 6.800834 -9.515493
H  1.138778 6.236547 -8.66587
H  2.179574 7.600256 -9.135249
H  0.690928 7.286143 -10.025328
C  9.054189 4.16936 -13.599136
C  9.14203 2.753187 -13.016881
H  9.304563 2.021609 -13.81551
H  9.985809 2.700739 -12.321028
H  8.23076 2.488771 -12.475985
C  8.815633 5.209743 -12.497292
H  7.898559 4.997362 -11.943434
H  9.656842 5.193506 -11.796386
H  8.743121 6.213422 -12.929578
C  10.339609 4.502326 -14.362009
H  10.283794 5.504819 -14.801485
H  11.189358 4.474594 -13.674579
H  10.518342 3.775122 -15.162219
elementType: S O N C H
totalener: -1503.11254784000585 hartree
nucrepener: 1648.03937720429394 hartree
electener: -3151.12474435761487 hartree
oneelecener: -5337.14642066109263 hartree
twoeener: 2186.02167630347776 hartree
cpcmener: -0.02718068668490 hartree
kineticenergy: 1499.58259981095443 hartree
exchangeener: -145.256417533318 hartree
correlationener: -6.826163474681 hartree
xcener: -152.082581007999 hartree
energy: -2399.7305 -2396.0278 -510.1234 -381.8950 -381.0332 -380.8497 -272.5109 -270.9822 -270.4308 -270.1285 -269.9789 -269.9712 -269.7224 -269.7116 -269.3069 -269.1795 -269.0245 -269.0238 -214.0052 -210.9247 -160.4472 -160.3589 -160.3372 -157.4094 -157.2461 -157.0710 -27.2861 -24.9176 -23.6281 -21.9052 -21.8100 -20.2846 -19.7662 -18.8727 -18.6777 -17.2394 -17.1588 -16.9868 -15.9407 -15.4796 -15.3450 -14.6128 -13.8068 -13.2491 -12.9728 -12.0327 -11.7271 -11.4878 -11.2570 -11.0786 -10.8744 -10.5654 -10.5403 -10.3218 -10.1953 -10.0157 -9.4483 -9.3697 -9.2602 -9.1923 -9.1223 -8.8145 -8.7815 -8.4907 -8.4114 -8.2934 -8.1405 -7.9608 -7.5572 -7.4181 -6.9513 -6.6087 -6.5635 -6.1617 -4.9224 -2.0879 -1.4117 -1.0870 -0.8842 0.4825 0.7228 1.0005 1.2667 1.2891 1.4612 1.7243 electronvolt
chargesum: 0.0000000
charge: 0.702260 0.038092 -0.487660 -0.477038 0.192025 0.129163 -0.381268 -0.145992 0.137907 -0.224290 0.266909 -0.195462 0.126482 0.201177 -0.200721 0.123830 -0.207214 0.138517 -0.355105 0.133075 0.133540 0.133887 0.229434 -0.365947 0.113520 0.119786 0.125769 -0.365553 0.127633 0.119031 0.112847 -0.380235 0.127637 0.126190 0.127772
charge: 0.745750 0.496390 -0.309090 -0.522890 -0.602743 -0.283847 -0.133631 -0.116706 0.154787 0.180764 0.209465 -0.102678 0.155134 -0.147730 -0.097324 0.156290 -0.117389 0.157532 -0.244522 0.131044 0.135894 0.137283 -0.361561 -0.255081 0.125797 0.130180 0.122662 -0.255116 0.122598 0.129824 0.125410 -0.254417 0.127461 0.133015 0.127446
qa: 0.7023 0.0381 -0.4877 -0.4770 0.1920 0.1292 -0.3813 -0.1460 0.1379 -0.2243 0.2669 -0.1955 0.1265 0.2012 -0.2007 0.1238 -0.2072 0.1385 -0.3551 0.1331 0.1335 0.1339 0.2294 -0.3659 0.1135 0.1198 0.1258 -0.3656 0.1276 0.1190 0.1128 -0.3802 0.1276 0.1262 0.1278
va: 5.6568 2.5850 2.0049 2.6742 4.2113 3.6081 2.8693 3.8921 0.9911 3.2865 0.9361 3.9140 0.9695 3.6659 3.8498 0.9690 3.9476 0.9733 3.8538 0.9751 0.9678 0.9663 3.8113 3.8380 0.9851 0.9776 0.9990 3.8371 0.9953 0.9776 0.9854 3.8496 0.9775 0.9804 0.9775
dispersion: -0.178322763 hartree
energy: -1503.290870602728 hartree
dipole: 17.529466577 -15.590231241 1.939235336 10.373464400 -7.996752673 2.376711727 13.212633346 -12.469635376 0.742997970
dipolemethod: SCF
magnitude: 3.156174632 au
magnitude: 8.022358366 debye
temp: 298.15 k
press: 1.00 atm
zeropoint: 0.27407401 hartree
thermalvibcorrection: 0.01654150 hartree
thermalrotcorrection: 0.00141627 hartree
thermaltrasncorrection: 0.00141627 hartree
thermaltotal: -1502.99742255 hartree
thermalcorr: 0.01937404 hartree
nonthermalcorr: 0.27407401 hartree
totalcorr: 0.29344805 hartree
thermalcorrenthalpy: 0.00094421 hartree
totalenthalpy: -1502.99647834 hartree
vibrat: 0.03000571 hartree
rotat: 0.01613708 hartree
transl: 0.02034660 hartree
total: 0.06648939 hartree
totalentropycorr: -0.06648939 hartree
gibbsenthalpy: -1503.06296773 hartree
gibbsminuselec: 0.22790287 hartree
