program: Gaussian 09
title: 000076646
version: EM64L-G09RevD.01
frameworkgroup: C1[X(C5H13NO)]
method: RPBEPBE
basis: SDD
operation: Freq
keyword: #p
keyword: freq=noraman
keyword: PBEPBE/SDD
title: #p freq=noraman PBEPBE/SDD
converged: YES YES NO NO
title: Mulliken charges:
elementType: O N C C C C C H H H H H H H H H H H H H
charge: -0.452721 -0.078794 -0.327562 -0.383541 -0.328639 -0.625992 -0.612523 0.168964 0.200359 0.232759 0.223597 0.187142 0.183330 0.240988 0.182575 0.219098 0.222390 0.184398 0.223431 0.340744
chargesum: 0.00000
title: Mulliken charges with hydrogens summed into heavy atoms:
elementType: O N C C C C C
charge: -0.111978 -0.078794 0.041761 0.072815 0.041832 0.016668 0.017696
polarizability: 8.11279935e+01 -5.97127900e-01 6.26111557e+01 6.90598348e-01 -7.55944115e-01 5.44747294e+01
1716.lowfreq: -15.3268 -0.0010 -0.0010 -0.0008 4.2601 12.9369 59.0353 77.9891 122.8823
frequency: 58.9806 77.9859 122.8737 142.8371 228.7155 238.4648 271.6481 310.1143 315.9433 343.1704 455.8083 492.2369 785.1569 810.5382 880.3744 969.9327 1018.6881 1029.0774 1034.3727 1075.8890 1093.1133 1101.8354 1141.8739 1165.5324 1204.4012 1234.3873 1262.0275 1279.6906 1293.7963 1306.4052 1380.2405 1414.0996 1418.7645 1442.4824 1461.0660 1462.2118 1474.3089 1475.4367 1478.4341 1484.7302 1491.2766 2809.8562 2837.0542 2854.2552 2924.5913 2972.1242 2993.5211 3010.0773 3015.9569 3029.7560 3074.6788 3077.6793 3088.4470 3565.2886
redmass: 2.2920 2.4854 2.9774 2.3436 1.1348 1.1432 1.0951 2.7960 2.6282 2.5126 2.3980 3.0460 1.1422 3.9876 1.2059 6.1520 2.3321 2.3783 1.6801 1.9066 1.4379 1.5084 1.5235 1.4066 1.3516 1.6707 2.5037 1.1471 1.1886 1.4786 1.3990 1.3886 1.1807 1.1677 1.0533 1.0659 1.0693 1.0697 1.0564 1.0619 1.0855 1.0703 1.0578 1.0578 1.0545 1.1069 1.0847 1.0605 1.0713 1.0716 1.1016 1.1038 1.1003 1.0664
irintensity: 8.1753 1.9782 2.9358 4.1197 2.0121 1.6145 146.3632 13.9903 2.2142 10.8086 1.2851 21.4248 1.5659 18.0215 0.4091 93.3996 12.2124 12.8329 22.3551 14.1167 6.8488 6.6878 4.8668 1.2532 9.0567 40.0614 3.2308 2.2155 2.2649 19.4901 10.8276 5.8774 3.6330 3.3649 16.1015 11.7088 0.5419 8.7499 15.5917 9.5924 11.9963 78.2667 75.3497 228.1142 76.6895 59.0648 27.0956 29.5316 46.9948 47.1108 23.6008 60.0951 39.5602 2.2211
temp: 298.150 k
press: 1.00000 atm
elementType: 8 7 6 6 6 6 6 1 1 1 1 1 1 1 1 1 1 1 1 1
symmnumber: 1
zpe: 466437.2 jmol-1
zpe.correction: 0.177657 hartree
zpe.thermalcorrener: 0.187194 hartree
zpe.thermalcorrenthalpy: 0.188138 hartree
zpe.thermalcorrgfe: 0.143181 hartree
zpe.sumelectzpe: -327.655055 hartree
zpe.sumelectthermal: -327.645518 hartree
zpe.sumelectthermalent: -327.644574 hartree
zpe.sumelectthermalfe: -327.689530 hartree
dipole: -0.0885 -1.7538 1.5728
dipole: 2.3574
quadrupole: -39.4811 -44.3683 -47.5984
quadrupole: -6.0799 1.6515 0.5862
quadrupole: 4.3348 -0.5524 -3.7825 -6.0799 1.6515 0.5862
hfenergy: -327.8327118 hartree
pointgroup: C01 [X(C5H13N1O1)]
dipole: -0.0449923 -0.6792882 0.6298892 debye
dipolederiv: -0.7381879 -0.2578547 0.1274738 -0.3148728 -0.3469049 -0.1011142 0.1427556 -0.1069667 -0.5459549 -0.6279289 -0.006451 0.0383087 -0.0058238 -0.5094604 -0.0009667 0.0059076 -0.0003456 -0.581019 0.4608163 -0.1330309 0.0860488 -0.1174242 0.1654982 -0.0328693 0.0660655 -0.0252238 0.4703337 -0.1927286 0.0152321 -0.0024365 0.0353871 0.0625758 0.0268357 -0.0463695 0.048381 0.0799569 0.6805719 0.1759471 -0.0925406 0.1416378 0.3580931 0.0366505 -0.0584231 0.0361422 0.4346546 0.0645833 -0.0654508 -0.0532936 -0.0762073 0.3597131 0.0955256 -0.0809587 0.0972248 0.3997307 0.3251935 0.1696022 -0.0800285 0.2251315 0.2066265 -0.0480041 -0.0891497 -0.0520563 0.3696873 -0.0670877 0.0184685 0.0298359 0.011017 0.034419 0.0035116 -0.0974369 0.0935831 -0.3070517 0.0507263 0.0165333 -0.0074489 0.0323086 -0.1816811 -0.0529555 -0.0064239 -0.0783354 0.0357331 0.0846142 -0.0017231 -0.0217032 0.0086246 0.0653247 0.0442295 0.0052869 0.0428486 -0.1254869 0.0855651 -0.0023596 0.009653 -0.0009293 -0.1222358 -0.0716998 0.0024084 -0.0835913 0.0359315 -0.0300658 -0.0346467 0.0155589 -0.0315323 -0.2082884 -0.0854795 0.0198408 -0.1252661 -0.0077938 -0.0169436 -0.0369595 0.0185322 -0.0391695 0.0093983 0.059917 0.0181531 0.1004077 -0.2353554 -0.016959 -0.168174 0.056726 -0.1267733 -0.0198741 0.0173932 0.0634712 0.0079448 0.0569579 0.0625974 0.0321329 0.0243155 0.0160302 -0.036565 0.0218318 0.0750838 -0.1644334 -0.2905724 -0.1221008 0.1407681 -0.0862579 0.064323 0.0557039 0.012722 -0.0953493 0.0261208 0.0367108 -0.1409153 0.0351055 -0.0830291 0.1120688 0.0613916 0.0674037 -0.0902425 0.0559527 0.0366745 -0.0375744 -0.0728297 0.0227592 -0.0779362 0.0193599 0.0054632 0.1984831 0.1187342 -0.2654857 0.0902279 0.0616427 0.043716 -0.0193332 -0.1554594 -0.0915253 0.03689 -0.084576 0.0486332 0.0855962 0.1140477 -0.0461897 0.163473 0.1823652 0.0931309 -0.0699926 0.0934546 0.3537156 unknown
polarizability: 81.0984894|-1.0610793|62.6270698|0.3860053|-0.8867323|54.4883195 unknown
InChI: InChI=1S/C5H13NO/c1-6(2)4-3-5-7/h7H,3-5H2,1-2H3
charge 0 multiplicity 1
20 atoms
O  3.363412 0.270627 -0.171005
N  -1.566746 0.05742 -0.257828
C  -0.325092 -0.533623 0.296005
C  0.951602 0.211115 -0.146837
C  2.21722 -0.569412 0.219214
C  -1.815149 1.437484 0.206418
C  -2.735517 -0.815157 -0.024393
H  -0.357787 -0.580316 1.419184
H  -0.273886 -1.580751 -0.065328
H  0.918931 0.364471 -1.240847
H  1.018192 1.206991 0.328587
H  2.237129 -1.540812 -0.322524
H  2.237032 -0.778409 1.312314
H  -0.989774 2.100718 -0.101301
H  -1.928146 1.514468 1.319426
H  -2.74239 1.818258 -0.257942
H  -3.624676 -0.386391 -0.520677
H  -2.980631 -0.953744 1.060806
H  -2.548779 -1.812847 -0.461324
H  4.206855 -0.20729 0.031249
