program: Orca
programVersion: 6.1.0
elementType: S S C N O C H H N O C H H N O C H H C H H C C H C H C C H C H C H H H
charge: 0
multiplicity: 1
keywords: TPSSh DEF2-TZVP CPCM(DMSO) def2/j verytightscf rijcosx DefGrid3 FREQ
frequency: 0.00 0.00 0.00 0.00 0.00 0.00 24.73 28.46 34.10 44.18 59.65 76.34 104.98 118.07 158.95 182.64 204.64 235.66 259.38 272.27 305.06 318.01 329.00 348.58 365.53 399.88 406.97 412.25 417.09 468.84 493.91 505.98 514.62 566.19 610.20 614.47 634.66 653.33 669.18 717.93 772.84 796.48 812.92 832.53 840.50 854.41 857.06 889.56 937.74 945.65 981.70 987.58 1006.80 1007.43 1029.10 1030.38 1057.04 1073.01 1076.92 1095.40 1109.29 1129.07 1133.82 1183.74 1200.63 1226.62 1232.62 1238.07 1255.69 1288.38 1321.29 1334.24 1344.39 1357.31 1365.90 1383.31 1400.39 1404.78 1419.36 1424.20 1467.23 1475.74 1478.27 1482.10 1485.33 1492.99 1521.46 1603.99 1624.57 1637.90 3003.03 3004.76 3026.27 3052.58 3054.57 3083.05 3111.11 3112.80 3114.70 3130.54 3147.29 3162.07 3171.66 3175.91 3204.92
frequency: 24.73 28.46 34.10 44.18 59.65 76.34 104.98 118.07 158.95 182.64 204.64 235.66 259.38 272.27 305.06 318.01 329.00 348.58 365.53 399.88 406.97 412.25 417.09 468.84 493.91 505.98 514.62 566.19 610.20 614.47 634.66 653.33 669.18 717.93 772.84 796.48 812.92 832.53 840.50 854.41 857.06 889.56 937.74 945.65 981.70 987.58 1006.80 1007.43 1029.10 1030.38 1057.04 1073.01 1076.92 1095.40 1109.29 1129.07 1133.82 1183.74 1200.63 1226.62 1232.62 1238.07 1255.69 1288.38 1321.29 1334.24 1344.39 1357.31 1365.90 1383.31 1400.39 1404.78 1419.36 1424.20 1467.23 1475.74 1478.27 1482.10 1485.33 1492.99 1521.46 1603.99 1624.57 1637.90 3003.03 3004.76 3026.27 3052.58 3054.57 3083.05 3111.11 3112.80 3114.70 3130.54 3147.29 3162.07 3171.66 3175.91 3204.92
formula: C12H15N3O3S2
InChI: InChI=1/C12H15N3O3S2/c1-10-2-4-11(5-3-10)20(17)13-12(19(16)14-20)15-6-8-18-9-7-15/h2-5H,6-9H2,1H3
35 atoms
S  3.21526 8.242672 18.398914
S  4.041652 5.675917 18.703508
C  5.232421 7.106303 19.142144
N  2.796378 6.720069 18.482431
O  2.392668 9.130744 19.191225
C  6.92189 5.491557 19.919528
H  7.687962 5.216448 19.189979
H  6.100734 4.778667 19.862919
N  4.779304 8.301474 18.857238
O  4.60709 5.17544 17.416001
C  7.509009 5.498542 21.326599
H  6.717787 5.692142 22.062119
H  7.969672 4.533013 21.534925
N  6.439291 6.840752 19.591109
O  8.534692 6.481922 21.448828
C  8.006963 7.786344 21.209709
H  8.831436 8.488463 21.333452
H  7.224268 8.010516 21.945422
C  7.445524 7.898505 19.798164
H  6.973823 8.865495 19.639486
H  8.239653 7.752238 19.060837
C  3.172902 8.829616 16.731422
C  2.746355 10.131077 16.478462
H  2.434053 10.771413 17.293182
C  2.72883 10.589645 15.165978
H  2.400045 11.603139 14.963279
C  3.126409 9.768755 14.106339
C  3.551564 8.464624 14.393567
H  3.863954 7.813392 13.584312
C  3.575838 7.987314 15.695769
H  3.900282 6.974176 15.908525
C  3.076461 10.262002 12.686234
H  3.94246 9.91355 12.119373
H  3.042533 11.351697 12.648369
H  2.182146 9.880061 12.182939
elementType: S C N O H
totalener: -1652.98570125296169 hartree
nucrepener: 1941.90647239612667 hartree
electener: -3594.86071077121369 hartree
oneelecener: -6126.98377911296939 hartree
twoeener: 2532.12306834175570 hartree
cpcmener: -0.03145494059841 hartree
kineticenergy: 1647.58062922567615 hartree
exchangeener: -147.160315692044 hartree
correlationener: -5.755787119666 hartree
xcener: -152.916102811710 hartree
energy: -2419.4720 -2417.5673 -518.8616 -518.7047 -518.0830 -389.7786 -388.3694 -387.9406 -278.4082 -276.6788 -276.6656 -276.6108 -276.4804 -276.2923 -275.8816 -275.8153 -275.7803 -275.5095 -275.5025 -275.0920 -218.5980 -216.9571 -162.8510 -162.7592 -162.7417 -161.1892 -161.1590 -160.9652 -29.3857 -28.0072 -27.7747 -26.7557 -25.4837 -23.6838 -23.3505 -21.3172 -21.0599 -20.3870 -20.2330 -19.2738 -18.3395 -18.0098 -16.9175 -16.5981 -16.4745 -15.6254 -15.2515 -14.5636 -14.2958 -13.3078 -12.8687 -12.8550 -12.7396 -12.5003 -12.4199 -12.2749 -12.0457 -11.9409 -11.6769 -11.4081 -11.1524 -11.0947 -10.7246 -10.4197 -10.2033 -10.1106 -9.9159 -9.7558 -9.7063 -9.5088 -9.2263 -9.0805 -8.5606 -8.5428 -8.1761 -8.0248 -7.5920 -7.4322 -7.1046 -6.9704 -6.5918 -6.4244 -1.8822 -1.2639 -1.0286 -0.4572 0.6894 1.2651 1.2918 1.4329 1.6336 1.7076 1.8373 electronvolt
chargesum: -0.0000000
charge: 0.730617 0.454534 0.124821 -0.456975 -0.484034 -0.110375 0.135567 0.148505 -0.372040 -0.545841 -0.053914 0.111458 0.141967 -0.011103 -0.335656 -0.062691 0.141934 0.113873 -0.105777 0.156832 0.134230 0.087639 -0.155442 0.154403 -0.203901 0.141079 0.178427 -0.222957 0.139616 -0.146815 0.122076 -0.387819 0.146074 0.145835 0.145853
charge: 0.781272 0.617526 -0.461058 -0.490803 -0.281299 -0.226387 0.148299 0.144714 -0.126989 -0.421306 -0.297815 0.130553 0.139950 0.230773 0.136403 -0.297708 0.139757 0.130728 -0.210134 0.151023 0.148943 -0.285916 -0.116013 0.156796 -0.101283 0.156800 -0.146654 -0.098223 0.157341 -0.119745 0.149933 -0.242999 0.134010 0.131742 0.137769
qa: 0.7306 0.4545 0.1248 -0.4570 -0.4840 -0.1104 0.1356 0.1485 -0.3720 -0.5458 -0.0539 0.1115 0.1420 -0.0111 -0.3357 -0.0627 0.1419 0.1139 -0.1058 0.1568 0.1342 0.0876 -0.1554 0.1544 -0.2039 0.1411 0.1784 -0.2230 0.1396 -0.1468 0.1221 -0.3878 0.1461 0.1458 0.1459
va: 5.6553 3.9078 4.0587 2.7029 2.0131 3.9553 0.9765 0.9855 2.8788 1.8573 4.0592 0.9779 0.9594 3.4095 2.0108 4.0839 0.9585 0.9737 3.8898 0.9869 0.9783 3.6534 3.9311 0.9785 3.9187 0.9662 3.6927 3.9083 0.9668 3.8777 1.0307 3.8667 0.9658 0.9688 0.9631
energy: -1652.985701252962 hartree
dipole: 11.648548265 -9.282266824 2.366281441 6.061596852 -5.246766355 0.814830497 -7.216189315 6.856010899 -0.360178415
dipolemethod: SCF
magnitude: 2.528431349 au
magnitude: 6.426761746 debye
temp: 298.15 k
press: 1.00 atm
zeropoint: 0.26886637 hartree
thermalvibcorrection: 0.01600314 hartree
thermalrotcorrection: 0.00141627 hartree
thermaltrasncorrection: 0.00141627 hartree
thermaltotal: -1652.69799920 hartree
thermalcorr: 0.01883568 hartree
nonthermalcorr: 0.26886637 hartree
totalcorr: 0.28770205 hartree
thermalcorrenthalpy: 0.00094421 hartree
totalenthalpy: -1652.69705500 hartree
vibrat: 0.02836302 hartree
rotat: 0.01635269 hartree
transl: 0.02048902 hartree
total: 0.06520472 hartree
totalentropycorr: -0.06520472 hartree
gibbsenthalpy: -1652.76225972 hartree
gibbsminuselec: 0.22344154 hartree
