program: Orca
programVersion: 6.1.0
elementType: S S O N C C N C H N H C H C C H C H C H H H C C H H H C H H H C H H H
charge: 0
multiplicity: 1
keywords: TPSSh DEF2-TZVP CPCM(DMSO) def2/j verytightscf rijcosx DefGrid3 FREQ
frequency: 0.00 0.00 0.00 0.00 0.00 0.00 24.26 25.03 29.63 33.11 71.04 78.20 102.61 138.57 176.06 203.26 213.48 237.84 253.26 261.88 265.40 287.36 303.19 317.85 329.77 366.15 382.88 408.78 412.85 427.61 443.82 463.88 480.18 508.78 547.68 577.38 614.82 635.20 681.72 706.71 716.45 732.20 754.74 810.70 832.22 851.91 901.64 923.80 929.03 937.71 958.88 961.88 980.62 987.22 1006.91 1030.31 1048.89 1058.20 1064.43 1098.09 1127.84 1194.19 1199.31 1212.15 1222.79 1227.01 1243.82 1271.47 1326.90 1345.63 1390.98 1394.67 1405.48 1416.31 1422.68 1474.15 1476.74 1484.30 1484.77 1485.02 1488.02 1495.94 1506.85 1518.86 1528.36 1561.41 1604.85 1625.15 3026.67 3028.20 3031.85 3036.85 3081.25 3093.27 3100.22 3102.05 3114.94 3115.55 3118.56 3120.88 3169.36 3171.60 3195.98 3207.01 3572.22
frequency: 24.26 25.03 29.63 33.11 71.04 78.20 102.61 138.57 176.06 203.26 213.48 237.84 253.26 261.88 265.40 287.36 303.19 317.85 329.77 366.15 382.88 408.78 412.85 427.61 443.82 463.88 480.18 508.78 547.68 577.38 614.82 635.20 681.72 706.71 716.45 732.20 754.74 810.70 832.22 851.91 901.64 923.80 929.03 937.71 958.88 961.88 980.62 987.22 1006.91 1030.31 1048.89 1058.20 1064.43 1098.09 1127.84 1194.19 1199.31 1212.15 1222.79 1227.01 1243.82 1271.47 1326.90 1345.63 1390.98 1394.67 1405.48 1416.31 1422.68 1474.15 1476.74 1484.30 1484.77 1485.02 1488.02 1495.94 1506.85 1518.86 1528.36 1561.41 1604.85 1625.15 3026.67 3028.20 3031.85 3036.85 3081.25 3093.27 3100.22 3102.05 3114.94 3115.55 3118.56 3120.88 3169.36 3171.60 3195.98 3207.01 3572.22
formula: C12H17N3OS2
InChI: InChI=1/C12H17N3OS2/c1-9-5-7-10(8-6-9)18(16)14-11(17-15-18)13-12(2,3)4/h5-8,13H,1-4H3
35 atoms
S  4.562438 3.350782 -13.419704
S  5.585977 4.004635 -15.78934
O  4.335684 1.96313 -13.039046
N  4.176463 3.851954 -14.85721
C  6.692378 4.006753 -14.403041
C  3.645829 4.342311 -12.281559
N  6.13667 3.744234 -13.23526
C  3.081579 3.750389 -11.155406
H  3.186767 2.68579 -10.992475
N  7.990209 4.236367 -14.592204
H  8.272042 4.472847 -15.533873
C  2.383104 4.544872 -10.251713
H  1.94194 4.086986 -9.373047
C  2.239766 5.919495 -10.457223
C  2.818451 6.489017 -11.600558
H  2.716911 7.554395 -11.777712
C  3.518226 5.713075 -12.511746
H  3.958343 6.159342 -13.394976
C  1.474522 6.773382 -9.483544
H  1.193782 6.204636 -8.596349
H  2.068862 7.636827 -9.173429
H  0.561545 7.159584 -9.947002
C  9.08848 4.131995 -13.587443
C  9.149728 2.708709 -13.020888
H  9.306557 1.984734 -13.823936
H  9.985586 2.6382 -12.321056
H  8.231706 2.455677 -12.489671
C  8.88217 5.164289 -12.472567
H  7.961712 4.970374 -11.921268
H  9.722132 5.110692 -11.775992
H  8.840312 6.173209 -12.889632
C  10.375084 4.44489 -14.355499
H  10.338039 5.45125 -14.781249
H  11.225442 4.389495 -13.674372
H  10.53079 3.724334 -15.162903
elementType: S O N C H
totalener: -1503.71384994500204 hartree
nucrepener: 1645.02328385939359 hartree
electener: -3148.70956584401165 hartree
oneelecener: -5330.12134222338682 hartree
twoeener: 2181.41177637937517 hartree
cpcmener: -0.02756993082235 hartree
kineticenergy: 1498.85039213827486 hartree
exchangeener: -132.752373635315 hartree
correlationener: -5.233571756125 hartree
xcener: -137.985945391440 hartree
energy: -2419.1124 -2415.2815 -518.3305 -388.8788 -388.0209 -387.8201 -278.4207 -276.7213 -276.2072 -275.8644 -275.7638 -275.7563 -275.4791 -275.4701 -275.0843 -274.9698 -274.8267 -274.8238 -218.2281 -215.0464 -162.4749 -162.3942 -162.3764 -159.3175 -159.1703 -159.0083 -28.9386 -26.4896 -25.1293 -23.3579 -23.2649 -21.6420 -21.1227 -20.2124 -19.9348 -18.4748 -18.4467 -18.2944 -16.9984 -16.5269 -16.4491 -15.6370 -14.7778 -14.1667 -13.8403 -12.8933 -12.5727 -12.3837 -12.1213 -11.9514 -11.7375 -11.4110 -11.3543 -11.1465 -11.0244 -10.8163 -10.2377 -10.1658 -10.0711 -9.9919 -9.8689 -9.6095 -9.4718 -9.2257 -9.1137 -8.9960 -8.8067 -8.6447 -8.2608 -8.0970 -7.6177 -7.1929 -7.0718 -6.6871 -5.5176 -1.7396 -1.0008 -0.6556 -0.4907 0.9082 1.2169 1.4453 1.7245 1.7475 2.0214 2.2172 electronvolt
chargesum: 0.0000000
charge: 0.703754 0.024759 -0.506535 -0.471972 0.217302 0.101235 -0.385653 -0.145246 0.152945 -0.255778 0.281440 -0.204416 0.140265 0.175396 -0.198337 0.139119 -0.200389 0.151316 -0.384882 0.145030 0.144782 0.144441 0.153506 -0.370648 0.127279 0.133710 0.137946 -0.369532 0.138735 0.133236 0.126630 -0.401637 0.141700 0.138670 0.141827
charge: 0.750797 0.499557 -0.313901 -0.528058 -0.601152 -0.282927 -0.140754 -0.116126 0.155892 0.177862 0.211526 -0.103848 0.156096 -0.147437 -0.098706 0.157087 -0.117182 0.157756 -0.243365 0.130954 0.135348 0.136782 -0.362398 -0.254066 0.126178 0.130893 0.123165 -0.254155 0.122904 0.130598 0.125842 -0.254590 0.127979 0.133520 0.127928
qa: 0.7038 0.0248 -0.5065 -0.4720 0.2173 0.1012 -0.3857 -0.1452 0.1529 -0.2558 0.2814 -0.2044 0.1403 0.1754 -0.1983 0.1391 -0.2004 0.1513 -0.3849 0.1450 0.1448 0.1444 0.1535 -0.3706 0.1273 0.1337 0.1379 -0.3695 0.1387 0.1332 0.1266 -0.4016 0.1417 0.1387 0.1418
va: 5.6714 2.5237 1.9696 2.6491 4.1673 3.6324 2.8421 3.9191 0.9846 3.2355 0.9251 3.9259 0.9671 3.6956 3.8566 0.9655 3.9631 0.9733 3.8683 0.9709 0.9653 0.9642 3.9047 3.8448 0.9811 0.9743 0.9921 3.8411 0.9898 0.9744 0.9814 3.8569 0.9738 0.9772 0.9738
energy: -1503.713849945002 hartree
dipole: 17.550273883 -15.560573959 1.989699925 9.468867599 -7.180639600 2.288228000 13.543417037 -12.735882682 0.807534355
dipolemethod: SCF
magnitude: 3.137993770 au
magnitude: 7.976146290 debye
temp: 298.15 k
press: 1.00 atm
zeropoint: 0.27797789 hartree
thermalvibcorrection: 0.01645686 hartree
thermalrotcorrection: 0.00141627 hartree
thermaltrasncorrection: 0.00141627 hartree
thermaltotal: -1503.41658265 hartree
thermalcorr: 0.01928940 hartree
nonthermalcorr: 0.27797789 hartree
totalcorr: 0.29726729 hartree
thermalcorrenthalpy: 0.00094421 hartree
totalenthalpy: -1503.41563844 hartree
vibrat: 0.02924771 hartree
rotat: 0.01614577 hartree
transl: 0.02034660 hartree
total: 0.06574007 hartree
totalentropycorr: -0.06574007 hartree
gibbsenthalpy: -1503.48137852 hartree
gibbsminuselec: 0.23247143 hartree
