program: Orca
programVersion: 6.1.0
elementType: S S C N O C H H N C H H N O C H H C H H C C H C H C C H C H C H H H
charge: 0
multiplicity: 1
keywords: OPBE DEF2-TZVP CPCM(DMSO) def2/j verytightscf rijcosx DefGrid3 FREQ
frequency: 0.00 0.00 0.00 0.00 0.00 0.00 6.67 18.92 24.08 45.66 56.31 80.70 112.33 131.73 170.99 192.35 223.79 238.53 255.96 295.23 299.68 315.28 363.12 380.95 393.84 395.54 433.09 467.54 472.37 499.08 510.04 552.29 578.22 613.73 617.31 665.85 678.85 705.42 759.81 798.58 805.83 819.08 826.53 833.32 872.39 910.95 938.52 944.66 956.88 966.86 974.25 1002.78 1008.01 1014.90 1031.10 1051.71 1087.38 1095.95 1104.45 1123.83 1167.27 1199.37 1206.13 1213.95 1219.71 1235.20 1267.06 1279.76 1296.27 1311.45 1330.42 1344.12 1349.24 1364.18 1370.57 1376.90 1399.24 1410.33 1417.94 1422.28 1427.22 1431.14 1437.91 1484.66 1580.16 1588.51 1610.88 2963.53 2967.28 2994.73 2997.62 3008.09 3071.52 3077.14 3079.10 3079.79 3116.68 3123.25 3145.31 3148.46 3177.25 3185.02
frequency: 6.67 18.92 24.08 45.66 56.31 80.70 112.33 131.73 170.99 192.35 223.79 238.53 255.96 295.23 299.68 315.28 363.12 380.95 393.84 395.54 433.09 467.54 472.37 499.08 510.04 552.29 578.22 613.73 617.31 665.85 678.85 705.42 759.81 798.58 805.83 819.08 826.53 833.32 872.39 910.95 938.52 944.66 956.88 966.86 974.25 1002.78 1008.01 1014.90 1031.10 1051.71 1087.38 1095.95 1104.45 1123.83 1167.27 1199.37 1206.13 1213.95 1219.71 1235.20 1267.06 1279.76 1296.27 1311.45 1330.42 1344.12 1349.24 1364.18 1370.57 1376.90 1399.24 1410.33 1417.94 1422.28 1427.22 1431.14 1437.91 1484.66 1580.16 1588.51 1610.88 2963.53 2967.28 2994.73 2997.62 3008.09 3071.52 3077.14 3079.10 3079.79 3116.68 3123.25 3145.31 3148.46 3177.25 3185.02
formula: C12H15N3O2S2
InChI: InChI=1/C12H15N3O2S2/c1-10-2-4-11(5-3-10)19(16)13-12(18-14-19)15-6-8-17-9-7-15/h2-5H,6-9H2,1H3
34 atoms
S  5.60321 5.205368 3.481721
S  4.764294 3.799995 5.556007
C  6.464509 3.66988 5.146018
N  4.31181 4.616833 4.163432
O  5.878998 6.631306 3.581165
C  6.877101 2.305243 7.125016
H  5.799785 2.10526 7.073287
H  7.067844 2.96009 7.989496
N  6.839575 4.328352 4.057596
C  7.609357 0.981051 7.291354
H  7.373905 0.559476 8.275889
H  7.275145 0.27145 6.514181
N  7.311328 2.962691 5.905664
O  9.01415 1.143003 7.233334
C  9.38238 1.682929 5.975301
H  9.092335 0.990105 5.165924
H  10.47455 1.782118 5.976821
C  8.755978 3.046562 5.737853
H  9.16037 3.778455 6.455267
H  8.982953 3.390349 4.725986
C  5.469889 4.829628 1.757575
C  5.775096 5.803829 0.80813
H  6.081893 6.797946 1.12351
C  5.679855 5.490785 -0.545736
H  5.918364 6.2570 -1.283375
C  5.284507 4.218249 -0.974329
C  4.98583 3.255707 0.00388
H  4.67616 2.255816 -0.300967
C  5.07413 3.549819 1.357636
H  4.834519 2.79098 2.099463
C  5.169008 3.887558 -2.43209
H  4.118559 3.720956 -2.708203
H  5.709446 2.962737 -2.670215
H  5.561149 4.692584 -3.061212
elementType: S C N O H
totalener: -1577.27072401516989 hartree
nucrepener: 1754.02347247746093 hartree
electener: -3331.26790480570662 hartree
oneelecener: -5650.60430212458050 hartree
twoeener: 2319.33639731887388 hartree
cpcmener: -0.02629168692434 hartree
kineticenergy: 1573.05652964905880 hartree
exchangeener: -154.616568360896 hartree
correlationener: -5.480044615009 hartree
xcener: -160.096612975904 hartree
energy: -2399.4018 -2395.9472 -510.7295 -510.0557 -382.3496 -380.9751 -380.8435 -272.1331 -270.3647 -270.3310 -270.2262 -270.1513 -270.0938 -269.8247 -269.6080 -269.5959 -269.3579 -269.3494 -268.8941 -213.6871 -210.8540 -159.5416 -159.4617 -159.4376 -156.7504 -156.5864 -156.4299 -27.5253 -26.6493 -25.3722 -24.1254 -22.2165 -22.0278 -20.2428 -19.8113 -19.3756 -18.9835 -18.1425 -17.4165 -16.9161 -15.7771 -15.5154 -15.3968 -14.5174 -14.0972 -13.4485 -13.3177 -12.2584 -12.0135 -11.8940 -11.7310 -11.5315 -11.3601 -11.3153 -11.0210 -10.8498 -10.4350 -10.3669 -10.2494 -9.7934 -9.5485 -9.3352 -9.2273 -9.1798 -8.8501 -8.7471 -8.5962 -8.2863 -8.0330 -7.7618 -7.6338 -7.3956 -7.1032 -6.6940 -6.6550 -6.3311 -5.8856 -4.9623 -2.1014 -1.4259 -1.0069 -0.9249 0.7542 0.8222 1.0245 1.2515 1.3585 1.3683 1.4582 electronvolt
chargesum: -0.0000000
charge: 0.526430 -0.037285 -0.014264 -0.376814 -0.421726 -0.093386 0.121169 0.083147 -0.283532 -0.056239 0.122127 0.064615 0.166900 -0.234311 -0.054600 0.063178 0.121553 -0.084018 0.076445 0.128550 0.259072 -0.163187 0.119334 -0.231277 0.107889 0.323093 -0.234266 0.102378 -0.236133 0.115037 -0.393536 0.133076 0.134951 0.145630
charge: 0.700660 0.508913 -0.595556 -0.497397 -0.281285 -0.256071 0.151449 0.144752 -0.125569 -0.322177 0.140865 0.130632 0.210938 0.168702 -0.321806 0.130222 0.140621 -0.241236 0.144844 0.153940 -0.281189 -0.121021 0.157394 -0.105179 0.157490 -0.154806 -0.100419 0.158226 -0.120029 0.159855 -0.253179 0.142013 0.140132 0.135270
qa: 0.5264 -0.0373 -0.0143 -0.3768 -0.4217 -0.0934 0.1212 0.0831 -0.2835 -0.0562 0.1221 0.0646 0.1669 -0.2343 -0.0546 0.0632 0.1216 -0.0840 0.0764 0.1285 0.2591 -0.1632 0.1193 -0.2313 0.1079 0.3231 -0.2343 0.1024 -0.2361 0.1150 -0.3935 0.1331 0.1350 0.1456
va: 5.8568 2.6878 4.4036 2.7548 2.1175 4.1756 0.9930 0.9925 2.9915 4.2928 0.9607 0.9898 3.3964 2.1792 4.3102 0.9889 0.9600 4.0963 0.9944 0.9989 3.6530 3.9135 0.9869 3.9352 0.9646 3.7435 3.8584 0.9652 3.9620 0.9702 3.9003 0.9798 0.9803 0.9774
energy: -1577.270724015170 hartree
dipole: 8.300313060 -7.230902601 1.069410460 -11.404379455 9.010841085 -2.393538370 -8.598426323 7.905850015 -0.692576308
dipolemethod: SCF
magnitude: 2.711517398 au
magnitude: 6.892129500 debye
temp: 298.15 k
press: 1.00 atm
zeropoint: 0.26107771 hartree
thermalvibcorrection: 0.01534288 hartree
thermalrotcorrection: 0.00141627 hartree
thermaltrasncorrection: 0.00141627 hartree
thermaltotal: -1576.99147089 hartree
thermalcorr: 0.01817542 hartree
nonthermalcorr: 0.26107771 hartree
totalcorr: 0.27925312 hartree
thermalcorrenthalpy: 0.00094421 hartree
totalenthalpy: -1576.99052668 hartree
vibrat: 0.02803082 hartree
rotat: 0.01630704 hartree
transl: 0.02041480 hartree
total: 0.06475266 hartree
totalentropycorr: -0.06475266 hartree
gibbsenthalpy: -1577.05527934 hartree
gibbsminuselec: 0.21544467 hartree
