program: Orca
programVersion: 6.1.0
elementType: S S C N O C H H N O C H H N O C H H C H H C C H C H C C H C H C H H H
charge: 0
multiplicity: 1
keywords: PBE DEF2-TZVP CPCM(DMSO) def2/j verytightscf rijcosx DefGrid3 FREQ
frequency: 0.00 0.00 0.00 0.00 0.00 0.00 25.50 27.34 34.54 43.20 58.49 75.45 101.96 117.00 158.70 178.58 200.23 231.62 256.95 268.86 299.60 309.33 326.16 343.35 355.53 392.69 396.49 404.02 415.20 465.32 483.63 491.12 506.53 553.10 594.56 601.29 621.71 633.29 649.30 700.02 748.34 779.69 796.42 803.29 819.11 819.47 836.04 867.95 892.89 923.85 939.55 943.87 974.04 987.42 1001.23 1003.66 1016.79 1040.49 1045.81 1067.14 1078.13 1090.30 1104.59 1158.87 1165.65 1194.45 1201.25 1205.50 1217.67 1247.57 1278.77 1287.56 1306.14 1320.53 1332.00 1336.08 1346.49 1350.13 1372.87 1384.45 1404.79 1413.24 1414.89 1421.75 1422.33 1429.58 1473.98 1563.77 1583.53 1611.74 2928.02 2929.74 2967.90 2983.05 2984.56 3028.13 3043.90 3045.37 3061.20 3064.50 3079.46 3089.83 3106.93 3109.11 3138.06
frequency: 25.50 27.34 34.54 43.20 58.49 75.45 101.96 117.00 158.70 178.58 200.23 231.62 256.95 268.86 299.60 309.33 326.16 343.35 355.53 392.69 396.49 404.02 415.20 465.32 483.63 491.12 506.53 553.10 594.56 601.29 621.71 633.29 649.30 700.02 748.34 779.69 796.42 803.29 819.11 819.47 836.04 867.95 892.89 923.85 939.55 943.87 974.04 987.42 1001.23 1003.66 1016.79 1040.49 1045.81 1067.14 1078.13 1090.30 1104.59 1158.87 1165.65 1194.45 1201.25 1205.50 1217.67 1247.57 1278.77 1287.56 1306.14 1320.53 1332.00 1336.08 1346.49 1350.13 1372.87 1384.45 1404.79 1413.24 1414.89 1421.75 1422.33 1429.58 1473.98 1563.77 1583.53 1611.74 2928.02 2929.74 2967.90 2983.05 2984.56 3028.13 3043.90 3045.37 3061.20 3064.50 3079.46 3089.83 3106.93 3109.11 3138.06
formula: C12H15N3O3S2
InChI: InChI=1/C12H15N3O3S2/c1-10-2-4-11(5-3-10)20(17)13-12(19(16)14-20)15-6-8-18-9-7-15/h2-5H,6-9H2,1H3
35 atoms
S  3.194617 8.249811 18.412572
S  4.026078 5.663972 18.700064
C  5.228154 7.110373 19.152817
N  2.767968 6.716382 18.501317
O  2.368787 9.14774 19.209871
C  6.921288 5.488422 19.927482
H  7.688049 5.201448 19.190481
H  6.094389 4.769788 19.877942
N  4.773189 8.309741 18.870948
O  4.592237 5.175232 17.395105
C  7.518313 5.492393 21.333601
H  6.72232 5.68589 22.077435
H  7.974113 4.515023 21.540116
N  6.443269 6.837354 19.594952
O  8.552607 6.470634 21.458646
C  8.028917 7.777764 21.208653
H  8.86171 8.484267 21.323309
H  7.245733 8.018647 21.951934
C  7.456495 7.888185 19.798221
H  6.991669 8.867419 19.639563
H  8.253163 7.738673 19.051811
C  3.162382 8.838731 16.733953
C  2.715111 10.136861 16.472759
H  2.382416 10.778484 17.288613
C  2.702465 10.593444 15.154366
H  2.356324 11.607911 14.944678
C  3.125636 9.775171 14.09534
C  3.572139 8.474673 14.392984
H  3.906757 7.82303 13.582678
C  3.591385 7.998087 15.700861
H  3.934022 6.983394 15.920139
C  3.08039 10.262877 12.674159
H  3.958538 9.92186 12.107942
H  3.030097 11.358564 12.6276
H  2.19058 9.865439 12.159375
elementType: S C N O H
totalener: -1651.57183032783792 hartree
nucrepener: 1932.61608843917315 hartree
electener: -3584.15728655742305 hartree
oneelecener: -6108.59514050495363 hartree
twoeener: 2524.43785394753058 hartree
cpcmener: -0.03063220958815 hartree
kineticenergy: 1646.35258544824865 hartree
exchangeener: -161.761591258386 hartree
correlationener: -5.727835906147 hartree
xcener: -167.489427164533 hartree
energy: -2401.0224 -2399.1642 -510.7685 -510.5192 -509.8916 -382.7104 -381.2343 -380.8269 -272.0805 -270.4375 -270.4270 -270.3624 -270.2448 -270.1712 -269.7481 -269.6192 -269.5819 -269.3432 -269.3366 -268.8614 -213.2222 -211.6125 -159.4029 -159.3116 -159.2924 -157.7812 -157.7498 -157.5594 -27.5943 -26.2977 -25.9989 -25.0878 -23.8566 -22.1378 -21.7864 -19.9022 -19.6595 -19.0607 -18.8040 -18.0172 -17.0909 -16.8371 -15.8273 -15.4608 -15.3088 -14.5465 -14.1548 -13.5844 -13.3601 -12.4289 -12.0668 -11.9394 -11.8745 -11.6466 -11.5819 -11.4105 -11.2127 -11.0430 -10.8323 -10.5414 -10.3511 -10.2599 -9.9275 -9.6405 -9.3784 -9.3294 -9.1980 -8.9689 -8.9323 -8.8194 -8.4689 -8.3247 -7.8741 -7.8374 -7.5335 -7.3619 -6.9751 -6.8240 -6.7020 -6.4109 -5.9992 -5.8854 -2.3614 -1.8025 -1.5861 -1.0963 -0.0353 0.5251 0.5981 0.7824 0.9984 1.0851 1.1646 electronvolt
chargesum: -0.0000000
charge: 0.626111 0.398191 0.064176 -0.401355 -0.430496 -0.144688 0.137541 0.149135 -0.308103 -0.499862 -0.083291 0.110937 0.143508 0.061183 -0.282895 -0.092765 0.143663 0.114097 -0.133880 0.153788 0.136740 0.116287 -0.169804 0.149688 -0.204754 0.139676 0.190508 -0.223539 0.138654 -0.153103 0.111384 -0.399291 0.147021 0.146112 0.149426
charge: 0.768546 0.600133 -0.468557 -0.481429 -0.268941 -0.242091 0.152601 0.150067 -0.116487 -0.406347 -0.313651 0.133853 0.145055 0.238090 0.154466 -0.313480 0.144950 0.134168 -0.225832 0.155948 0.153657 -0.286026 -0.122926 0.159484 -0.103870 0.160298 -0.151533 -0.100984 0.160858 -0.126753 0.152037 -0.256577 0.139757 0.137188 0.144327
qa: 0.6261 0.3982 0.0642 -0.4014 -0.4305 -0.1447 0.1375 0.1491 -0.3081 -0.4999 -0.0833 0.1109 0.1435 0.0612 -0.2829 -0.0928 0.1437 0.1141 -0.1339 0.1538 0.1367 0.1163 -0.1698 0.1497 -0.2048 0.1397 0.1905 -0.2235 0.1387 -0.1531 0.1114 -0.3993 0.1470 0.1461 0.1494
va: 5.6727 3.9576 4.0966 2.7419 2.0841 3.9312 0.9762 0.9881 2.9301 1.9193 4.0474 0.9787 0.9575 3.3849 2.0718 4.0752 0.9565 0.9742 3.8599 0.9919 0.9778 3.6280 3.9369 0.9820 3.9217 0.9660 3.6686 3.9086 0.9667 3.8619 1.0476 3.8549 0.9656 0.9694 0.9609
energy: -1651.571830327838 hartree
dipole: 11.801462540 -9.407624785 2.393837755 6.029863177 -5.239515333 0.790347844 -7.295166166 6.921992928 -0.373173238
dipolemethod: SCF
magnitude: 2.548404830 au
magnitude: 6.477530300 debye
temp: 298.15 k
press: 1.00 atm
zeropoint: 0.26177520 hartree
thermalvibcorrection: 0.01635179 hartree
thermalrotcorrection: 0.00141627 hartree
thermaltrasncorrection: 0.00141627 hartree
thermaltotal: -1651.29087079 hartree
thermalcorr: 0.01918433 hartree
nonthermalcorr: 0.26177520 hartree
totalcorr: 0.28095954 hartree
thermalcorrenthalpy: 0.00094421 hartree
totalenthalpy: -1651.28992658 hartree
vibrat: 0.02892085 hartree
rotat: 0.01636568 hartree
transl: 0.02048902 hartree
total: 0.06577555 hartree
totalentropycorr: -0.06577555 hartree
gibbsenthalpy: -1651.35570213 hartree
gibbsminuselec: 0.21612820 hartree
