program: Orca
programVersion: 6.1.0
elementType: S S C N O C H H N O C H H N O C H H C H H C C H C H C C H C H C H H H
charge: 0
multiplicity: 1
keywords: M06L DEF2-TZVP CPCM(DMSO) def2/j verytightscf rijcosx DefGrid3 FREQ
frequency: 0.00 0.00 0.00 0.00 0.00 0.00 27.92 38.41 42.37 48.62 61.59 85.88 108.02 126.29 164.02 185.96 210.43 238.80 266.22 280.20 313.02 325.09 335.97 354.46 372.71 408.17 415.06 422.77 425.30 480.57 505.28 514.36 524.48 573.78 617.18 621.00 645.29 660.48 675.68 728.19 792.98 809.89 827.86 837.95 849.45 864.79 874.54 902.04 960.57 972.50 987.07 1004.75 1011.77 1024.05 1037.74 1040.56 1059.36 1080.45 1111.03 1117.64 1124.78 1131.69 1141.69 1194.41 1206.50 1241.54 1246.29 1257.24 1294.06 1296.14 1329.15 1332.19 1351.92 1370.00 1373.80 1388.20 1409.11 1410.02 1423.38 1437.94 1456.86 1463.08 1474.75 1476.73 1481.91 1481.99 1532.78 1621.10 1647.90 1656.30 3007.37 3009.36 3058.32 3063.58 3064.67 3131.03 3132.84 3133.69 3157.08 3158.84 3164.70 3170.35 3185.77 3187.12 3214.28
frequency: 27.92 38.41 42.37 48.62 61.59 85.88 108.02 126.29 164.02 185.96 210.43 238.80 266.22 280.20 313.02 325.09 335.97 354.46 372.71 408.17 415.06 422.77 425.30 480.57 505.28 514.36 524.48 573.78 617.18 621.00 645.29 660.48 675.68 728.19 792.98 809.89 827.86 837.95 849.45 864.79 874.54 902.04 960.57 972.50 987.07 1004.75 1011.77 1024.05 1037.74 1040.56 1059.36 1080.45 1111.03 1117.64 1124.78 1131.69 1141.69 1194.41 1206.50 1241.54 1246.29 1257.24 1294.06 1296.14 1329.15 1332.19 1351.92 1370.00 1373.80 1388.20 1409.11 1410.02 1423.38 1437.94 1456.86 1463.08 1474.75 1476.73 1481.91 1481.99 1532.78 1621.10 1647.90 1656.30 3007.37 3009.36 3058.32 3063.58 3064.67 3131.03 3132.84 3133.69 3157.08 3158.84 3164.70 3170.35 3185.77 3187.12 3214.28
formula: C12H15N3O3S2
InChI: InChI=1/C12H15N3O3S2/c1-10-2-4-11(5-3-10)20(17)13-12(19(16)14-20)15-6-8-18-9-7-15/h2-5H,6-9H2,1H3
35 atoms
S  3.166011 8.278997 18.44425
S  3.976187 5.719663 18.727902
C  5.172633 7.139592 19.17237
N  2.744878 6.767015 18.52506
O  2.343132 9.174217 19.210718
C  6.868049 5.510462 19.88036
H  7.588037 5.230687 19.107635
H  6.041938 4.804522 19.852741
N  4.721512 8.333634 18.90869
O  4.548957 5.244929 17.443615
C  7.526192 5.49488 21.243472
H  6.775904 5.68315 22.021994
H  7.977111 4.521082 21.425158
N  6.386271 6.860787 19.589566
O  8.560706 6.458024 21.324725
C  8.037755 7.760807 21.132101
H  8.867398 8.458454 21.23119
H  7.298137 7.986071 21.910796
C  7.407504 7.900096 19.764591
H  6.94388 8.873851 19.637651
H  8.160277 7.763686 18.984584
C  3.160208 8.84699 16.777654
C  2.675776 10.11369 16.486654
H  2.295657 10.742649 17.280076
C  2.686716 10.551229 15.172218
H  2.30974 11.53928 14.937519
C  3.173389 9.744265 14.146383
C  3.657124 8.473876 14.472056
H  4.038332 7.833705 13.685383
C  3.652143 8.018475 15.775559
H  4.020435 7.027719 16.023105
C  3.162638 10.209037 12.728258
H  4.115082 10.008914 12.238494
H  2.951886 11.273385 12.655212
H  2.399711 9.679865 12.154549
elementType: S C N O H
totalener: -1652.78223876150719 hartree
nucrepener: 1953.27436809400683 hartree
electener: -3606.02828714153111 hartree
oneelecener: -6149.82924241342789 hartree
twoeener: 2543.80095527189678 hartree
cpcmener: -0.02831971398302 hartree
kineticenergy: 1648.03510899787238 hartree
xcener: -169.140913038324 hartree
energy: -2414.3254 -2412.3692 -516.5788 -516.3255 -515.6908 -387.7247 -386.2081 -385.7736 -276.5725 -274.9736 -274.9593 -274.8841 -274.7529 -274.4196 -274.1143 -273.9803 -273.9294 -273.6894 -273.6798 -273.3168 -219.3209 -217.6222 -162.4937 -162.3820 -162.3645 -160.7822 -160.7447 -160.5443 -29.2692 -27.9938 -27.7338 -26.5161 -25.3057 -23.4718 -22.9329 -20.9373 -20.6692 -19.9677 -19.7890 -18.8691 -17.9112 -17.5465 -16.4615 -16.1430 -15.9846 -15.1257 -14.7810 -14.0518 -13.7849 -12.8836 -12.4875 -12.3769 -12.2689 -12.0579 -11.9682 -11.8161 -11.6263 -11.4372 -11.2065 -10.8638 -10.6663 -10.6263 -10.3307 -9.9835 -9.7083 -9.6504 -9.4512 -9.3094 -9.2193 -9.1368 -8.7711 -8.5656 -8.1290 -8.1114 -7.7480 -7.6022 -7.1909 -7.0543 -6.7672 -6.5707 -6.1895 -6.0023 -2.0334 -1.4099 -1.2330 -0.5914 0.6234 1.2851 1.3403 1.5683 1.7048 1.8328 1.8754 electronvolt
chargesum: -0.0000000
charge: 1.071303 0.560601 0.547801 -0.597275 -0.610501 -0.003395 0.088943 0.098772 -0.645987 -0.623316 0.148576 0.062802 0.064186 -0.259121 -0.488801 0.136046 0.063353 0.065840 0.023144 0.101926 0.082653 -0.005167 -0.047488 0.117365 -0.206591 0.089675 0.241614 -0.281649 0.089717 -0.119071 0.166137 -0.166566 0.079507 0.071694 0.083272
charge: 0.802586 0.628319 -0.446497 -0.501479 -0.281368 -0.210155 0.138877 0.136059 -0.135840 -0.423636 -0.277918 0.120412 0.129889 0.220490 0.134495 -0.277966 0.129682 0.120380 -0.193370 0.142097 0.139399 -0.284387 -0.108011 0.147163 -0.092860 0.146098 -0.146985 -0.088366 0.146818 -0.116001 0.142234 -0.214123 0.124899 0.120477 0.128586
qa: 1.0713 0.5606 0.5478 -0.5973 -0.6105 -0.0034 0.0889 0.0988 -0.6460 -0.6233 0.1486 0.0628 0.0642 -0.2591 -0.4888 0.1360 0.0634 0.0658 0.0231 0.1019 0.0827 -0.0052 -0.0475 0.1174 -0.2066 0.0897 0.2416 -0.2816 0.0897 -0.1191 0.1661 -0.1666 0.0795 0.0717 0.0833
va: 5.3078 3.7176 3.7212 2.6102 1.8789 3.7582 0.9914 0.9975 2.7584 1.7868 3.7781 0.9965 0.9915 3.1485 1.7732 3.8005 0.9917 0.9925 3.6886 1.0020 0.9950 3.8828 3.8301 0.9878 3.9020 0.9896 3.5942 4.0180 0.9994 3.8676 0.9942 3.7885 0.9737 0.9856 0.9709
energy: -1652.782238761507 hartree
dipole: 12.172878170 -9.841775086 2.331103084 5.652817250 -4.934384995 0.718432255 -7.538300345 7.204872628 -0.333427718
dipolemethod: SCF
magnitude: 2.461983050 au
magnitude: 6.257863592 debye
temp: 298.15 k
press: 1.00 atm
zeropoint: 0.27124543 hartree
thermalvibcorrection: 0.01566514 hartree
thermalrotcorrection: 0.00141627 hartree
thermaltrasncorrection: 0.00141627 hartree
thermaltotal: -1652.49249565 hartree
thermalcorr: 0.01849768 hartree
nonthermalcorr: 0.27124543 hartree
totalcorr: 0.28974312 hartree
thermalcorrenthalpy: 0.00094421 hartree
totalenthalpy: -1652.49155144 hartree
vibrat: 0.02752247 hartree
rotat: 0.01633896 hartree
transl: 0.02048902 hartree
total: 0.06435045 hartree
totalentropycorr: -0.06435045 hartree
gibbsenthalpy: -1652.55590189 hartree
gibbsminuselec: 0.22633687 hartree
