program: Orca
programVersion: 6.1.0
elementType: S S O C N C N C H C H C C H C H C H H H C C H C H C H C H C H
charge: 0
multiplicity: 1
keywords: TPSSh D4 DEF2-TZVP CPCM(DMSO) def2/j verytightscf rijcosx DefGrid3 FREQ
frequency: 0.00 0.00 0.00 0.00 0.00 0.00 25.34 28.74 30.07 35.06 74.49 93.91 105.85 157.15 187.09 228.01 245.67 293.59 302.34 319.19 335.25 382.50 402.24 408.31 415.73 449.64 492.51 509.60 563.11 613.22 617.68 632.36 635.63 675.35 693.43 698.67 717.07 755.96 780.73 802.09 818.60 832.63 851.79 856.76 939.89 950.85 981.50 984.93 988.82 989.47 1009.01 1012.90 1013.72 1030.77 1046.22 1057.06 1103.73 1104.93 1131.74 1174.73 1191.76 1197.71 1222.01 1230.92 1259.06 1329.47 1341.60 1352.37 1359.10 1404.70 1425.38 1460.30 1478.42 1482.21 1488.52 1521.13 1528.32 1608.56 1614.15 1627.34 1633.85 3027.00 3085.13 3117.34 3165.48 3173.87 3174.84 3175.68 3185.26 3194.81 3199.03 3201.86 3209.95
frequency: 25.34 28.74 30.07 35.06 74.49 93.91 105.85 157.15 187.09 228.01 245.67 293.59 302.34 319.19 335.25 382.50 402.24 408.31 415.73 449.64 492.51 509.60 563.11 613.22 617.68 632.36 635.63 675.35 693.43 698.67 717.07 755.96 780.73 802.09 818.60 832.63 851.79 856.76 939.89 950.85 981.50 984.93 988.82 989.47 1009.01 1012.90 1013.72 1030.77 1046.22 1057.06 1103.73 1104.93 1131.74 1174.73 1191.76 1197.71 1222.01 1230.92 1259.06 1329.47 1341.60 1352.37 1359.10 1404.70 1425.38 1460.30 1478.42 1482.21 1488.52 1521.13 1528.32 1608.56 1614.15 1627.34 1633.85 3027.00 3085.13 3117.34 3165.48 3173.87 3174.84 3175.68 3185.26 3194.81 3199.03 3201.86 3209.95
formula: C14H12N2OS2
InChI: InChI=1/C14H12N2OS2/c1-11-7-9-13(10-8-11)19(17)15-14(18-16-19)12-5-3-2-4-6-12/h2-10H,1H3
31 atoms
S  5.006654 7.737457 -11.961771
S  4.486851 10.104493 -10.867022
O  6.351099 7.294251 -12.284739
C  4.538095 8.749085 -9.79023
N  4.569967 9.215694 -12.284743
C  3.887334 6.678001 -12.799258
N  4.714735 7.575605 -10.351325
C  4.362141 5.5320 -13.4295
H  5.420199 5.306584 -13.420113
C  3.456167 4.693592 -14.065887
H  3.816292 3.797703 -14.55914
C  2.089244 4.985629 -14.080489
C  1.641145 6.144153 -13.432672
H  0.582968 6.380804 -13.431666
C  2.529232 6.993437 -12.792614
H  2.18003 7.889662 -12.295289
C  1.119227 4.08883 -14.795968
H  1.530084 3.086525 -14.92416
H  0.174362 4.021019 -14.253173
H  0.897515 4.490365 -15.790265
C  4.419372 8.922673 -8.34554
C  3.927816 10.119119 -7.808273
H  3.604572 10.919848 -8.465006
C  3.828408 10.275419 -6.433443
H  3.443881 11.201648 -6.023682
C  4.21279 9.239034 -5.583912
H  4.131553 9.361909 -4.510199
C  4.698647 8.044984 -6.113843
H  4.999307 7.24007 -5.45369
C  4.804203 7.883982 -7.488342
H  5.190982 6.964735 -7.90944
elementType: S O C N H
totalener: -1522.15754507738620 hartree
nucrepener: 1623.53934754251304 hartree
electener: -3145.67638793368087 hartree
oneelecener: -5311.01243167933717 hartree
twoeener: 2165.33604374565630 hartree
cpcmener: -0.02050446289269 hartree
kineticenergy: 1517.37036286457965 hartree
exchangeener: -134.582754638343 hartree
correlationener: -5.251429388566 hartree
xcener: -139.834184026909 hartree
energy: -2419.2851 -2415.6809 -518.5629 -388.4535 -388.1445 -277.8777 -276.2885 -276.1145 -275.9274 -275.8468 -275.8373 -275.7401 -275.6524 -275.5954 -275.5360 -275.5305 -275.5211 -275.5188 -275.1026 -218.4165 -215.4406 -162.6685 -162.5769 -162.5612 -159.7017 -159.5397 -159.4397 -29.1878 -26.2635 -23.9607 -23.4161 -23.1671 -21.7126 -20.9077 -20.2942 -20.2036 -19.9703 -18.6233 -17.3757 -17.0065 -16.5472 -16.2296 -15.6506 -15.2860 -14.3505 -14.0335 -13.0568 -12.7222 -12.5409 -12.3522 -11.9820 -11.8696 -11.6149 -11.4492 -11.3446 -11.2147 -11.1101 -10.8325 -10.2089 -9.9734 -9.9264 -9.6998 -9.4452 -9.3860 -9.2954 -9.1795 -8.8644 -8.4434 -8.2222 -7.8479 -7.2572 -7.1476 -7.0857 -6.8688 -5.9318 -2.4674 -1.7512 -1.0403 -1.0016 -0.5202 0.0777 1.2633 1.3447 1.5255 1.7194 1.8066 electronvolt
chargesum: 0.0000000
charge: 0.711575 0.110851 -0.487368 0.150577 -0.449845 0.107226 -0.309779 -0.147477 0.155568 -0.197235 0.142071 0.172418 -0.192969 0.142087 -0.198994 0.155230 -0.387211 0.146646 0.146844 0.146832 0.109014 -0.177281 0.143773 -0.148095 0.147117 -0.104795 0.148094 -0.124446 0.146236 -0.200778 0.144115
charge: 0.765420 0.599876 -0.295046 -0.477401 -0.501223 -0.289012 -0.097669 -0.111578 0.157258 -0.099152 0.157277 -0.143911 -0.096631 0.157840 -0.112675 0.159406 -0.241774 0.132400 0.134222 0.138694 -0.158056 -0.095077 0.153883 -0.128444 0.154117 -0.116685 0.153287 -0.127813 0.153778 -0.081744 0.156431
qa: 0.7116 0.1109 -0.4874 0.1506 -0.4498 0.1072 -0.3098 -0.1475 0.1556 -0.1972 0.1421 0.1724 -0.1930 0.1421 -0.1990 0.1552 -0.3872 0.1466 0.1468 0.1468 0.1090 -0.1773 0.1438 -0.1481 0.1471 -0.1048 0.1481 -0.1244 0.1462 -0.2008 0.1441
va: 5.6347 2.7502 1.9990 3.9866 2.7009 3.6377 2.9207 3.9291 0.9828 3.9117 0.9663 3.6997 3.8578 0.9653 3.9700 0.9697 3.8673 0.9683 0.9661 0.9632 3.6078 3.9201 0.9762 3.9201 0.9627 3.8964 0.9600 3.8864 0.9629 3.9480 0.9884
dispersion: -0.059292041 hartree
energy: -1522.216837118262 hartree
dipole: -11.810051454 9.569092076 -2.240959377 -11.627059738 10.934729342 -0.692330396 -0.242092684 1.309809173 1.067716489
dipolemethod: SCF
magnitude: 2.577060110 au
magnitude: 6.550366233 debye
temp: 298.15 k
press: 1.00 atm
zeropoint: 0.23067527 hartree
thermalvibcorrection: 0.01400777 hartree
thermalrotcorrection: 0.00141627 hartree
thermaltrasncorrection: 0.00141627 hartree
thermaltotal: -1521.96932154 hartree
thermalcorr: 0.01684031 hartree
nonthermalcorr: 0.23067527 hartree
totalcorr: 0.24751558 hartree
thermalcorrenthalpy: 0.00094421 hartree
totalenthalpy: -1521.96837733 hartree
vibrat: 0.02489027 hartree
rotat: 0.01625302 hartree
transl: 0.02037124 hartree
total: 0.06151453 hartree
totalentropycorr: -0.06151453 hartree
gibbsenthalpy: -1522.02989186 hartree
gibbsminuselec: 0.18694526 hartree
