program: Orca
programVersion: 6.1.0
elementType: S S N O C N O C H H N O C H H O C H H C H H C C H C H C C H C H C H H H
charge: 0
multiplicity: 1
keywords: TPSS DEF2-TZVP CPCM(DMSO) def2/j verytightscf rijcosx DefGrid3 FREQ
frequency: 0.00 0.00 0.00 0.00 0.00 0.00 12.01 22.06 25.04 32.79 53.83 57.33 99.04 115.10 146.72 170.38 200.71 216.23 230.39 248.55 291.93 294.86 312.17 316.67 351.52 379.74 396.53 400.19 417.50 428.55 457.98 466.61 493.01 507.74 514.09 569.00 590.71 617.12 626.76 634.50 657.18 705.84 762.49 798.23 805.84 821.55 825.96 834.45 835.95 871.29 926.21 963.90 967.74 968.25 985.64 996.53 1016.19 1018.46 1044.30 1051.94 1074.32 1080.76 1109.16 1114.31 1120.52 1156.88 1185.47 1209.24 1216.88 1221.49 1245.83 1257.64 1271.61 1302.85 1316.10 1335.22 1341.13 1350.33 1363.29 1376.03 1390.01 1401.42 1405.71 1457.33 1461.65 1464.14 1469.35 1469.67 1476.15 1497.17 1577.23 1595.56 1614.33 2973.97 2974.45 2997.77 3026.74 3028.25 3051.39 3081.15 3082.65 3084.24 3115.02 3116.54 3139.87 3142.23 3163.48 3174.65
frequency: 12.01 22.06 25.04 32.79 53.83 57.33 99.04 115.10 146.72 170.38 200.71 216.23 230.39 248.55 291.93 294.86 312.17 316.67 351.52 379.74 396.53 400.19 417.50 428.55 457.98 466.61 493.01 507.74 514.09 569.00 590.71 617.12 626.76 634.50 657.18 705.84 762.49 798.23 805.84 821.55 825.96 834.45 835.95 871.29 926.21 963.90 967.74 968.25 985.64 996.53 1016.19 1018.46 1044.30 1051.94 1074.32 1080.76 1109.16 1114.31 1120.52 1156.88 1185.47 1209.24 1216.88 1221.49 1245.83 1257.64 1271.61 1302.85 1316.10 1335.22 1341.13 1350.33 1363.29 1376.03 1390.01 1401.42 1405.71 1457.33 1461.65 1464.14 1469.35 1469.67 1476.15 1497.17 1577.23 1595.56 1614.33 2973.97 2974.45 2997.77 3026.74 3028.25 3051.39 3081.15 3082.65 3084.24 3115.02 3116.54 3139.87 3142.23 3163.48 3174.65
formula: C12H15N3O4S2
InChI: InChI=1/C12H15N3O4S2/c1-10-2-4-11(5-3-10)20(16)13-12(21(17,18)14-20)15-6-8-19-9-7-15/h2-5H,6-9H2,1H3
36 atoms
S  0.174585 13.219235 6.519896
S  0.961301 15.415019 7.805766
N  1.133343 13.812929 7.630082
O  -0.760604 12.193302 6.946467
C  -0.295637 15.626256 6.437782
N  -0.627234 14.494197 5.854925
O  0.341722 15.762849 9.077279
C  -1.812356 16.974439 5.075966
H  -2.745596 17.291947 5.553813
H  -1.959649 16.014582 4.580977
N  -0.797491 16.810469 6.141455
O  2.190436 16.120593 7.466423
C  -1.329525 18.037196 4.089815
H  -0.429992 17.684816 3.56452
H  -2.117431 18.248414 3.363322
O  -1.047237 19.273193 4.762081
C  -0.005227 19.089281 5.730305
H  0.165932 20.062619 6.195436
H  0.914506 18.752698 5.230211
C  -0.421052 18.07778 6.799395
H  0.397185 17.909061 7.499455
H  -1.297282 18.441971 7.346411
C  1.181901 12.545162 5.2330
C  2.415684 13.13102 4.930683
H  2.779152 13.978136 5.503645
C  3.173232 12.602828 3.891258
H  4.134069 13.052719 3.654579
C  2.72139 11.498871 3.147933
C  1.480093 10.934901 3.475272
H  1.113566 10.081152 2.911286
C  0.704108 11.44688 4.513437
H  -0.25296 11.001523 4.762748
C  3.56575 10.923864 2.039598
H  3.995327 11.718801 1.421377
H  2.980371 10.255279 1.402901
H  4.402007 10.348931 2.45712
elementType: S N O C H
totalener: -1728.37100345680392 hartree
nucrepener: 2136.73398847351609 hartree
electener: -3865.07225059410439 hartree
oneelecener: -6618.22596835830791 hartree
twoeener: 2753.15371776420352 hartree
cpcmener: -0.03274133621563 hartree
kineticenergy: 1722.59656866474188 hartree
exchangeener: -171.852124156365 hartree
correlationener: -6.042194998780 hartree
xcener: -177.894319155145 hartree
energy: -2409.8762 -2409.8687 -514.2784 -514.2717 -514.1637 -514.1555 -385.8738 -384.5361 -384.2232 -275.2285 -273.3050 -273.3019 -273.2518 -273.1552 -273.0131 -272.5255 -272.4839 -272.4825 -272.1713 -272.1626 -271.7409 -215.3576 -215.2934 -160.4196 -160.3486 -160.3193 -160.3083 -160.2662 -160.2595 -28.8692 -28.0548 -26.6994 -25.8073 -25.7680 -24.6085 -22.8917 -22.3126 -20.3904 -20.0746 -19.4757 -19.3083 -18.4362 -17.4058 -17.1819 -16.1464 -15.9133 -15.6932 -14.9980 -14.8674 -13.9953 -13.7264 -12.8359 -12.3669 -12.1865 -12.1580 -11.9626 -11.9197 -11.7500 -11.7179 -11.5566 -11.1470 -11.0931 -10.8097 -10.5514 -10.2794 -10.1196 -9.8457 -9.6175 -9.5528 -9.3767 -9.2423 -9.2010 -8.9976 -8.7435 -8.6442 -8.4771 -8.2449 -8.0228 -7.9841 -7.8186 -7.3214 -7.0996 -6.8243 -6.7468 -6.4937 -6.0464 -2.3309 -1.7167 -1.4688 -0.2390 0.2454 0.2887 0.8379 1.0840 1.1950 1.3336 1.3982 electronvolt
chargesum: -0.0000000
charge: 0.683983 0.700629 -0.410748 -0.454382 0.115138 -0.347039 -0.455046 -0.099367 0.133663 0.155451 -0.002947 -0.449733 -0.061636 0.111725 0.140966 -0.327228 -0.048553 0.141342 0.107590 -0.109688 0.146442 0.133151 0.106783 -0.153919 0.141061 -0.196618 0.135125 0.177547 -0.189672 0.137014 -0.163751 0.150196 -0.380120 0.144255 0.144083 0.144301
charge: 0.783599 0.582024 -0.408115 -0.266566 -0.433952 -0.114782 -0.295395 -0.206478 0.150046 0.151366 0.239041 -0.296688 -0.293845 0.130902 0.140359 0.134484 -0.293710 0.140572 0.130318 -0.220891 0.144727 0.149532 -0.280564 -0.113036 0.155964 -0.093291 0.157956 -0.141853 -0.097288 0.157213 -0.112274 0.157537 -0.242302 0.135075 0.131829 0.138488
qa: 0.6840 0.7006 -0.4107 -0.4544 0.1151 -0.3470 -0.4550 -0.0994 0.1337 0.1555 -0.0029 -0.4497 -0.0616 0.1117 0.1410 -0.3272 -0.0486 0.1413 0.1076 -0.1097 0.1464 0.1332 0.1068 -0.1539 0.1411 -0.1966 0.1351 0.1775 -0.1897 0.1370 -0.1638 0.1502 -0.3801 0.1443 0.1441 0.1443
va: 5.6653 5.8367 2.7622 2.0491 4.0216 2.8925 2.0159 3.8978 0.9784 0.9872 3.4467 2.0068 4.0940 0.9731 0.9575 2.0352 4.0548 0.9577 0.9799 3.9364 1.0043 0.9770 3.6450 3.9064 0.9902 3.8709 0.9666 3.6923 3.9198 0.9667 3.9383 0.9806 3.8677 0.9660 0.9699 0.9635
energy: -1728.371003456804 hartree
dipole: 3.062661780 -3.123285378 -0.060623599 4.140292009 -3.423409919 0.716882090 -20.498036397 16.606892096 -3.891144301
dipolemethod: SCF
magnitude: 3.957094783 au
magnitude: 10.058135605 debye
temp: 298.15 k
press: 1.00 atm
zeropoint: 0.27027378 hartree
thermalvibcorrection: 0.01711330 hartree
thermalrotcorrection: 0.00141627 hartree
thermaltrasncorrection: 0.00141627 hartree
thermaltotal: -1728.08078383 hartree
thermalcorr: 0.01994584 hartree
nonthermalcorr: 0.27027378 hartree
totalcorr: 0.29021962 hartree
thermalcorrenthalpy: 0.00094421 hartree
totalenthalpy: -1728.07983962 hartree
vibrat: 0.03086066 hartree
rotat: 0.01647611 hartree
transl: 0.02055954 hartree
total: 0.06789631 hartree
totalentropycorr: -0.06789631 hartree
gibbsenthalpy: -1728.14773593 hartree
gibbsminuselec: 0.22326752 hartree
