program: Orca
programVersion: 6.1.0
elementType: S S O N C C N C H N H C H C C H C H C H H H C C H H H C H H H C H H H
charge: 0
multiplicity: 1
keywords: CAM-B3LYP DEF2-TZVP CPCM(DMSO) def2/j verytightscf rijcosx DefGrid3 FREQ
frequency: 0.00 0.00 0.00 0.00 0.00 0.00 23.91 27.13 30.98 35.41 67.38 83.48 109.41 142.83 182.16 208.29 222.85 247.37 263.49 274.64 279.59 301.31 317.18 337.27 350.08 386.88 401.82 423.17 434.36 452.36 483.22 492.41 507.30 528.53 569.80 598.61 650.91 654.20 706.44 733.58 740.19 765.67 778.45 833.66 852.99 870.45 933.91 946.20 952.36 977.25 979.57 1006.24 1017.98 1020.81 1025.83 1051.37 1062.47 1076.26 1078.45 1132.55 1144.50 1210.78 1241.77 1244.13 1251.35 1264.15 1270.37 1308.37 1328.38 1344.72 1406.25 1409.49 1417.83 1428.86 1445.92 1472.68 1475.74 1483.08 1483.80 1488.30 1488.95 1495.91 1507.88 1550.34 1564.27 1600.01 1647.44 1672.01 3055.13 3058.91 3061.62 3066.92 3114.85 3121.98 3129.15 3131.01 3143.99 3145.12 3152.01 3154.69 3197.11 3201.30 3220.54 3236.40 3607.66
frequency: 23.91 27.13 30.98 35.41 67.38 83.48 109.41 142.83 182.16 208.29 222.85 247.37 263.49 274.64 279.59 301.31 317.18 337.27 350.08 386.88 401.82 423.17 434.36 452.36 483.22 492.41 507.30 528.53 569.80 598.61 650.91 654.20 706.44 733.58 740.19 765.67 778.45 833.66 852.99 870.45 933.91 946.20 952.36 977.25 979.57 1006.24 1017.98 1020.81 1025.83 1051.37 1062.47 1076.26 1078.45 1132.55 1144.50 1210.78 1241.77 1244.13 1251.35 1264.15 1270.37 1308.37 1328.38 1344.72 1406.25 1409.49 1417.83 1428.86 1445.92 1472.68 1475.74 1483.08 1483.80 1488.30 1488.95 1495.91 1507.88 1550.34 1564.27 1600.01 1647.44 1672.01 3055.13 3058.91 3061.62 3066.92 3114.85 3121.98 3129.15 3131.01 3143.99 3145.12 3152.01 3154.69 3197.11 3201.30 3220.54 3236.40 3607.66
formula: C12H17N3OS2
InChI: InChI=1/C12H17N3OS2/c1-9-5-7-10(8-6-9)18(16)14-11(17-15-18)13-12(2,3)4/h5-8,13H,1-4H3
35 atoms
S  4.54224 3.304516 -13.442687
S  5.575301 4.050723 -15.783934
O  4.282488 1.934582 -13.067183
N  4.184506 3.776996 -14.875239
C  6.670211 3.986329 -14.400775
C  3.655152 4.308424 -12.301032
N  6.110162 3.668433 -13.261233
C  3.094253 3.739623 -11.171475
H  3.178688 2.676412 -11.001387
N  7.958312 4.234701 -14.574404
H  8.241896 4.503946 -15.504221
C  2.42447 4.548454 -10.268188
H  1.984671 4.104798 -9.384176
C  2.308191 5.916497 -10.478576
C  2.882607 6.465065 -11.625467
H  2.800427 7.529489 -11.806272
C  3.551626 5.673292 -12.534825
H  3.987852 6.107676 -13.42392
C  1.574645 6.791102 -9.506775
H  1.288256 6.23773 -8.614385
H  2.190562 7.639648 -9.206722
H  0.668896 7.195255 -9.962581
C  9.042174 4.145536 -13.565785
C  9.137308 2.724184 -13.018214
H  9.310078 2.014389 -13.827729
H  9.973525 2.662095 -12.321745
H  8.229648 2.440326 -12.490415
C  8.803131 5.153158 -12.444596
H  7.887285 4.931514 -11.901282
H  9.636868 5.116324 -11.743261
H  8.736829 6.164034 -12.847929
C  10.323973 4.497871 -14.311128
H  10.268392 5.506047 -14.724686
H  11.168609 4.455123 -13.625673
H  10.505993 3.794359 -15.124994
elementType: S O N C H
totalener: -1503.29358455713646 hartree
nucrepener: 1654.62475504832696 hartree
electener: -3157.88936833975731 hartree
oneelecener: -5348.71828881818146 hartree
twoeener: 2190.82892047842415 hartree
cpcmener: -0.02898084171894 hartree
kineticenergy: 1498.83945714768174 hartree
xcener: -112.618237896253 hartree
energy: -2425.2049 -2421.1758 -522.2933 -392.6772 -391.7694 -391.4587 -282.3165 -280.3090 -279.7930 -279.4950 -279.3682 -279.3598 -279.0455 -279.0302 -278.5959 -278.4802 -278.3285 -278.3276 -222.4269 -219.0806 -167.0653 -166.9801 -166.9547 -163.7224 -163.5754 -163.4263 -32.2435 -29.6371 -28.2014 -26.3521 -26.2758 -24.6115 -24.0125 -23.0303 -22.8147 -21.2418 -21.1796 -21.0050 -19.7447 -19.2056 -19.0799 -18.2760 -17.3424 -16.7770 -16.4504 -15.4236 -15.0674 -14.8046 -14.6357 -14.3934 -14.1384 -13.7826 -13.7274 -13.5311 -13.4332 -13.1856 -12.4886 -12.3989 -12.3032 -12.2500 -12.1885 -11.7826 -11.7560 -11.5296 -11.3290 -11.2048 -11.0332 -10.8617 -10.5333 -10.3962 -9.7835 -9.2421 -8.9081 -8.5561 -7.4382 -0.2080 0.5378 0.9383 1.1716 1.9392 2.4455 2.7680 3.0283 3.0506 3.3077 3.4510 electronvolt
chargesum: -0.0000000
charge: 0.735125 0.088864 -0.509737 -0.504151 0.187385 0.065551 -0.383442 -0.161942 0.174465 -0.254212 0.272073 -0.210911 0.161945 0.136150 -0.201103 0.163428 -0.204952 0.175582 -0.394230 0.142940 0.148327 0.149203 0.194604 -0.399117 0.133537 0.138858 0.139295 -0.398163 0.140163 0.138725 0.132830 -0.436416 0.147810 0.143637 0.147879
charge: 0.764968 0.517205 -0.321383 -0.542751 -0.594804 -0.285043 -0.143685 -0.118169 0.158643 0.180261 0.211957 -0.108860 0.158593 -0.149561 -0.103409 0.159873 -0.119238 0.160787 -0.248328 0.132774 0.136764 0.138122 -0.371051 -0.259978 0.128302 0.132749 0.124681 -0.260016 0.124690 0.132565 0.128037 -0.260002 0.130026 0.135244 0.130040
qa: 0.7351 0.0889 -0.5097 -0.5042 0.1874 0.0656 -0.3834 -0.1619 0.1745 -0.2542 0.2721 -0.2109 0.1619 0.1361 -0.2011 0.1634 -0.2050 0.1756 -0.3942 0.1429 0.1483 0.1492 0.1946 -0.3991 0.1335 0.1389 0.1393 -0.3982 0.1402 0.1387 0.1328 -0.4364 0.1478 0.1436 0.1479
va: 5.7403 2.5321 1.9690 2.6236 4.2261 3.6003 2.7986 3.9133 0.9859 3.1696 0.9281 3.9010 0.9670 3.6413 3.8355 0.9655 3.9369 0.9694 3.8429 0.9690 0.9585 0.9570 3.7415 3.7663 0.9766 0.9703 0.9885 3.7670 0.9855 0.9703 0.9770 3.7831 0.9685 0.9736 0.9685
energy: -1503.293584557136 hartree
dipole: 17.627355756 -15.542439449 2.084916307 9.834931521 -7.392244112 2.442687409 13.755374608 -13.012530658 0.742843950
dipolemethod: SCF
magnitude: 3.296272883 au
magnitude: 8.378459822 debye
temp: 298.15 k
press: 1.00 atm
zeropoint: 0.28266751 hartree
thermalvibcorrection: 0.01587127 hartree
thermalrotcorrection: 0.00141627 hartree
thermaltrasncorrection: 0.00141627 hartree
thermaltotal: -1502.99221323 hartree
thermalcorr: 0.01870381 hartree
nonthermalcorr: 0.28266751 hartree
totalcorr: 0.30137133 hartree
thermalcorrenthalpy: 0.00094421 hartree
totalenthalpy: -1502.99126902 hartree
vibrat: 0.02813966 hartree
rotat: 0.01613118 hartree
transl: 0.02034660 hartree
total: 0.06461744 hartree
totalentropycorr: -0.06461744 hartree
gibbsenthalpy: -1503.05588646 hartree
gibbsminuselec: 0.23769809 hartree
