program: Gaussian 16
title: Title Card Required
version: ES64L-G16RevA.03
frameworkgroup: C1[X(C7H9NOS)]
method: RB3LYP
basis: def2SVP
operation: Freq
keyword: #N
keyword: Geom=AllCheck
keyword: Guess=TCheck
keyword: SCRF=Check
keyword: GenChk
keyword: RB3LYP/def2SVPFreq
converged: YES YES YES YES
title: Mulliken charges:
elementType: C C C C C C H H H H H S O C H H H N H
charge: -0.001353 0.024198 -0.091820 0.029299 -0.002987 0.026024 0.020653 0.012487 0.007961 0.020742 0.021312 0.608489 -0.532592 -0.020084 0.073000 0.086663 0.072680 -0.487352 0.132677
chargesum: -0.00000
title: Mulliken charges with hydrogens summed into heavy atoms:
elementType: C C C C C C S O C N
charge: 0.019300 0.036685 -0.091820 0.037261 0.017755 0.047336 0.608489 -0.532592 0.212259 -0.354674
chargesum: 0.00000
1716.lowfreq: -8.9099 0.0020 0.0022 0.0023 8.7148 14.3814 44.6373 113.3656 186.4289
frequency: 43.7812 113.3539 186.4219 230.0281 244.9950 281.5987 313.6411 386.1467 416.1151 420.7219 449.2253 489.7325 521.9175 626.1443 685.1647 715.0659 726.8722 778.4680 867.1962 937.8224 956.3936 963.3591 976.1835 1014.4408 1016.6341 1041.4570 1045.8028 1082.5826 1089.6230 1137.9300 1157.9317 1169.5623 1206.0253 1311.3329 1314.3021 1371.2217 1409.1619 1418.3947 1473.0435 1501.4194 1641.8040 1645.3173 3055.7537 3174.7247 3188.1454 3191.2998 3197.1819 3205.7156 3215.9658 3220.9794 3470.7771
redmass: 4.1732 3.7066 3.0402 1.2326 2.5518 2.9783 6.3497 2.0092 4.2346 2.8596 2.6210 4.9882 3.7219 6.3822 5.8368 2.1193 3.5615 1.7713 1.2450 1.2347 1.4240 1.4082 4.3971 5.0184 1.4367 1.9537 1.4903 1.8727 1.5559 1.9563 1.0792 1.2218 6.4367 1.3485 1.2061 8.4339 1.0533 1.0483 2.3564 2.2819 6.2068 6.5943 1.0289 1.1081 1.0877 1.1111 1.0914 1.0964 1.0956 1.0956 1.0739
irintensity: 3.1428 7.1366 0.4066 0.9129 9.1740 16.0958 16.0778 40.9405 0.8623 0.0990 120.2633 152.6044 44.1491 0.0182 57.0555 34.6351 97.0132 31.0032 0.5009 95.5636 33.4182 7.0663 292.4509 8.7011 3.4443 9.5237 1.5692 83.6400 2.0379 174.4086 0.2407 8.6681 264.8929 3.4553 11.2634 5.9192 11.0869 9.9198 29.4622 9.4014 2.7969 0.1904 0.0718 0.6212 0.4786 0.1181 11.1514 7.0557 5.1562 3.6710 40.8692
temp: 298.150 k
press: 1.00000 atm
elementType: 6 6 6 6 6 6 1 1 1 1 1 16 8 6 1 1 1 7 1
symmnumber: 1
zpe: 390574.0 jmol-1
zpe.correction: 0.148762 hartree
zpe.thermalcorrener: 0.158315 hartree
zpe.thermalcorrenthalpy: 0.159259 hartree
zpe.thermalcorrgfe: 0.113789 hartree
zpe.sumelectzpe: -799.721381 hartree
zpe.sumelectthermal: -799.711828 hartree
zpe.sumelectthermalent: -799.710884 hartree
zpe.sumelectthermalfe: -799.756354 hartree
dipole: 2.2207 -0.9878 -4.6531
dipole: 5.2496
quadrupole: -54.1446 -66.8011 -69.1598
quadrupole: 4.6259 7.1534 1.1188
quadrupole: 9.2239 -3.4326 -5.7913 4.6259 7.1534 1.1188
hfenergy: -799.8701429 hartree
pointgroup: C01 [X(C7H9N1O1S1)]
dipole: 0.8159311 0.8465878 -1.6980038 debye
dipolederiv: -0.0968151 0.1676444 0.1443343 0.0558684 -0.047303 0.0715362 0.0529952 0.0690695 -0.0781744 -0.0691143 -0.1568331 -0.1596777 0.1517863 -0.1009539 -0.0247151 0.0976108 0.000899 -0.0565837 -0.4045358 0.0369576 0.0445208 0.0445687 -0.2226243 0.1087981 0.0642939 0.0990977 -0.2491899 -0.0744386 0.1693075 0.1177781 -0.0972401 -0.0477427 -0.0005943 -0.1192504 -0.0335918 -0.0888321 -0.1341519 -0.1544644 -0.1383874 -0.0471196 -0.0444508 0.0818599 -0.0439311 0.0826523 -0.0529187 0.1237735 0.0103733 -0.0252154 0.0113372 -0.0151069 0.0797419 -0.018425 0.0783742 -0.0331136 0.0324871 -0.0681358 -0.0530616 -0.0720047 0.0489057 -0.083928 -0.0478039 -0.0854775 0.0790779 0.146665 0.0724258 0.0705994 0.031715 0.1109008 -0.0215739 0.0204377 -0.040215 0.1050273 0.1240534 -0.0602636 -0.0599107 -0.0374876 0.0948701 -0.0422648 -0.0462305 -0.0202745 0.120983 0.0484024 0.0526582 0.0517527 0.0520963 0.0489732 -0.0937844 0.0596576 -0.0932373 0.0639873 -0.0808206 -0.0040412 0.0174492 -0.0025466 0.1289661 -0.0132418 0.0171992 -0.0126913 0.1315727 2.7080916 0.1058092 -0.0532469 0.2473309 2.5085593 -0.0099422 -0.001395 0.0165402 2.1021593 -1.0243193 0.0723572 0.1160692 0.1100815 -1.0140799 -0.3455424 0.157957 -0.2180029 -1.3058164 -0.449282 0.0046354 -0.0296692 -0.056469 -0.3552664 0.1370204 -0.0395798 0.0814468 -0.2638831 0.1046461 0.0339286 0.0088878 0.0477606 0.0482854 -0.0092662 0.0115608 -0.0070911 -0.0035135 -0.0113105 -0.0018411 0.0064172 0.0544141 0.1069722 0.038268 -0.0529077 0.0407348 0.0814169 0.110046 -0.0144713 -0.0363048 -0.0570894 -0.0248964 0.0331258 -0.0197273 0.0492019 0.0415123 -1.1385366 -0.3280374 0.0110357 -0.5394058 -1.5521977 0.1214109 -0.0966401 0.0182328 -0.9530688 0.0851597 0.0619908 -0.0333707 0.1024037 0.3281891 -0.0269083 0.0041787 -0.0256679 0.3593574 unknown
polarizability: 173.8973249|5.6032117|128.7990505|-0.4877333|32.4362161|109.0539708 unknown
InChI: InChI=1/7C.N.O.S.9H
charge 0 multiplicity 1
19 atoms
C  2.44491581 1.01898612 0.83817093
C  1.05369336 1.00810059 0.96804251
C  0.31576585 0.08335602 0.22737952
C  0.92840075 -0.82758961 -0.63717137
C  2.31923991 -0.80541799 -0.7582653
C  3.0749917 0.11541802 -0.02323246
H  3.03741363 1.73341929 1.41425694
H  0.53929555 1.6978763 1.63883064
H  0.32247201 -1.54346689 -1.19356099
H  2.8152732 -1.51243468 -1.42725074
H  4.16313837 0.12665629 -0.12186078
S  -1.46784836 0.12152059 0.39734969
O  -1.81219984 0.90705287 1.61270595
C  -2.0040039 1.13571291 -1.00076264
H  -1.6830474 0.65774337 -1.93534487
H  -3.10184739 1.1782659 -0.93954342
H  -1.57621814 2.14159057 -0.89385759
N  -1.88566069 -1.36301902 0.22332515
H  -2.90602642 -1.39811064 0.11049283
