program: Gaussian 16
title: Title Card Required
version: ES64L-G16RevA.03
frameworkgroup: C1[X(C2H5N3OS)]
method: RB3LYP
basis: def2SVP
operation: Freq
keyword: #N
keyword: Geom=AllCheck
keyword: Guess=TCheck
keyword: SCRF=Check
keyword: GenChk
keyword: RB3LYP/def2SVPFreq
converged: YES YES YES YES
title: Mulliken charges:
elementType: C S N N O C H H H H N H
charge: 0.244224 0.509757 -0.336159 -0.270738 -0.199182 0.001205 0.081608 0.084383 0.053658 0.062511 -0.350492 0.119224
chargesum: -0.00000
title: Mulliken charges with hydrogens summed into heavy atoms:
elementType: C S N N O C N
charge: 0.306735 0.509757 -0.336159 -0.270738 -0.199182 0.220855 -0.231268
chargesum: 0.00000
1716.lowfreq: -2.1415 -0.0042 -0.0030 -0.0025 2.6925 4.8632 148.9358 161.0296 193.7413
frequency: 148.9358 161.0295 193.7413 325.3609 337.1192 392.0615 532.3937 567.2094 604.2683 618.2436 734.8109 769.0687 864.2444 914.7471 928.4204 934.3225 966.1036 1085.9744 1175.5047 1204.7596 1293.3300 1309.6902 1421.8376 1424.6442 1611.6913 3067.3491 3195.6510 3197.5373 3201.0299 3491.9956
redmass: 2.3050 1.7678 2.6873 3.9969 4.1063 4.7875 3.4694 5.7928 2.4344 1.8684 6.7955 8.9868 9.0566 1.8287 3.1709 1.4445 1.4315 1.7912 2.8686 3.4556 1.4608 1.2095 1.0506 1.0472 8.1193 1.0276 1.1096 1.0970 1.1104 1.0741
irintensity: 1.1135 0.7947 0.9021 0.3428 0.3331 32.9864 29.4612 24.6147 93.2403 11.2200 48.7511 52.2895 17.8678 2.8722 10.6454 17.7824 9.5712 245.1522 52.5017 62.8503 10.3134 5.6437 9.1563 6.7487 166.1879 0.6760 0.8507 1.7838 0.5971 25.7930
temp: 298.150 k
press: 1.00000 atm
elementType: 6 16 7 7 8 6 1 1 1 1 7 1
symmnumber: 1
zpe: 219353.7 jmol-1
zpe.correction: 0.083547 hartree
zpe.thermalcorrener: 0.090528 hartree
zpe.thermalcorrenthalpy: 0.091473 hartree
zpe.thermalcorrgfe: 0.052602 hartree
zpe.sumelectzpe: -716.263746 hartree
zpe.sumelectthermal: -716.256765 hartree
zpe.sumelectthermalent: -716.255821 hartree
zpe.sumelectthermalfe: -716.294691 hartree
dipole: -0.5506 2.1623 -0.2944
dipole: 2.2506
quadrupole: -46.1710 -46.6322 -51.1001
quadrupole: 0.3836 5.4347 5.2633
quadrupole: 1.7968 1.3356 -3.1323 0.3836 5.4347 5.2633
hfenergy: -716.3472933 hartree
pointgroup: C01 [X(C2H5N3O1S1)]
dipole: -0.1958556 0.8546671 -0.1233862 debye
dipolederiv: 0.7422006 0.134672 -0.2653552 0.2269656 0.2952593 -0.2567972 -0.3635943 -0.2552886 0.5793958 2.1641455 -0.2219409 0.0074279 -0.1376779 1.4654397 0.3534225 -0.0009987 0.296632 0.8712631 -1.1585378 0.024569 0.0603866 0.1175566 -0.5376082 0.0752355 -0.0286566 0.0157615 -0.5120431 -0.2632945 0.0425227 -0.0846087 -0.1824803 -0.3856918 -0.0616939 0.2163519 -0.0096167 -0.342932 -0.6619388 -0.0585663 0.2272473 0.0092966 -0.2713177 0.2046936 0.1324589 0.2068076 -0.4505033 -0.2771369 -0.1274644 -0.0306055 -0.0916694 -0.166626 -0.0669816 0.0024264 0.0243154 -0.0342076 0.0509152 -0.0029998 -0.0285089 -0.011667 0.0329874 0.0226851 -0.0371918 0.0011357 0.0722849 0.0544758 -0.0412261 -0.0016027 -0.0598508 0.0309505 -0.0180553 -0.0079942 -0.0078713 0.0231762 0.0116483 0.0189387 0.0194987 0.0106859 0.031781 -0.0374169 0.0198666 -0.030949 0.0609607 0.0091379 0.0434142 -0.0270971 0.0044569 0.1322046 0.0009398 -0.0138287 0.0188215 0.1161233 -0.8509287 0.3093255 0.1789881 0.2293024 -0.8181693 -0.1845826 0.1293824 -0.234259 -0.6301802 0.1793135 -0.1212446 -0.0557706 -0.1149186 0.1907906 -0.0314491 -0.0482219 -0.0254889 0.2466621 unknown
polarizability: 77.220456|-4.3056396|54.9256247|-0.2064198|-0.3106612|47.3746089 unknown
InChI: InChI=1/2C.3N.O.S.5H
charge 0 multiplicity 1
12 atoms
C  -1.76792203 0.47505165 -0.48584729
S  0.49993018 -0.18400571 -0.04236291
N  -0.6194437 0.72701849 -1.00819432
N  -0.59945496 -0.86645776 0.95390772
O  -1.8728036 -0.29780396 0.58277069
C  1.48768816 1.15253613 0.65855077
H  2.20827824 0.69268046 1.34575699
H  1.99879691 1.6586178 -0.17024364
H  0.79920734 1.82760682 1.18045247
H  -2.72057049 0.86187366 -0.86398995
N  1.58954971 -1.08387043 -0.64351851
H  1.14208062 -1.92833948 -1.01736053
