program: Gaussian 16
title: Title Card Required
version: ES64L-G16RevA.03
frameworkgroup: C1[X(C6H5O2S)]
method: RB3LYP
basis: def2SVP
operation: Freq
keyword: #N
keyword: Geom=AllCheck
keyword: Guess=TCheck
keyword: SCRF=Check
keyword: GenChk
keyword: RB3LYP/def2SVP
keyword: Freq
converged: YES YES YES YES
title: Mulliken charges:
elementType: C C C C C C H H H H H S O O
charge: -0.009761 -0.024678 -0.122192 -0.022895 -0.011800 -0.010266 -0.001132 -0.031740 -0.031374 -0.000832 0.001121 0.635698 -0.683818 -0.686330
chargesum: -1.00000
title: Mulliken charges with hydrogens summed into heavy atoms:
elementType: C C C C C C S O O
charge: -0.010892 -0.056418 -0.122192 -0.054270 -0.012632 -0.009145 0.635698 -0.683818 -0.686330
1716.lowfreq: -5.8922 -0.0033 -0.0028 -0.0019 4.9105 27.9364 68.1289 129.2460 172.6385
frequency: 62.7972 129.2187 172.6315 261.2678 368.3336 402.2444 418.2718 457.2648 572.0682 627.7154 672.6832 727.1358 779.0638 875.7663 944.3811 982.8661 1007.8534 1013.9513 1029.8015 1038.3422 1059.8961 1070.7457 1087.9826 1150.5159 1155.7239 1297.9883 1365.7514 1462.7323 1490.0678 1632.7275 1635.8704 3161.9592 3167.3655 3176.8253 3179.0148 3190.3823
redmass: 6.6077 5.8436 6.7899 8.5604 7.9034 5.7076 2.8174 13.0876 4.4059 6.3747 6.4965 1.6626 1.9798 1.2463 1.4257 13.8428 1.4044 6.5732 1.3749 2.4312 2.2835 2.6461 3.0669 1.0877 1.1368 1.3785 8.7842 2.2580 2.2710 6.0704 6.5632 1.0856 1.0878 1.0920 1.0947 1.0991
irintensity: 2.1954 5.5727 1.1138 0.6240 0.9274 40.8375 0.1806 28.0452 73.6162 0.0733 19.8758 51.6083 39.5437 3.3309 17.2843 170.6042 11.4850 12.2518 3.7641 7.5190 228.3382 38.3761 105.5731 0.0787 0.1507 3.6319 0.0296 17.5121 6.2255 1.5692 0.1876 1.5190 5.8008 2.6808 49.4774 39.5750
temp: 298.150 k
press: 1.00000 atm
elementType: 6 6 6 6 6 6 1 1 1 1 1 16 8 8
symmnumber: 1
zpe: 256175.5 jmol-1
zpe.correction: 0.097572 hartree
zpe.thermalcorrener: 0.105239 hartree
zpe.thermalcorrenthalpy: 0.106183 hartree
zpe.thermalcorrgfe: 0.064407 hartree
zpe.sumelectzpe: -779.892633 hartree
zpe.sumelectthermal: -779.884966 hartree
zpe.sumelectthermalent: -779.884022 hartree
zpe.sumelectthermalfe: -779.925798 hartree
dipole: -9.6095 -0.0775 -1.9137
dipole: 9.7985
quadrupole: -79.5956 -66.6497 -64.4873
quadrupole: -0.1211 -4.8893 0.5134
quadrupole: -9.3514 3.5945 5.7569 -0.1211 -4.8893 0.5134
hfenergy: -779.9902054 hartree
pointgroup: C01 [X(C6H5O2S1)]
dipole: 3.7175887 0.2982209 -0.9756311 debye
dipolederiv: 0.0373286 -0.0896859 0.001138 -0.0106188 0.0889812 0.0110927 0.039214 0.0123138 -0.1529447 -0.2406582 0.1209189 0.0117485 -0.0152275 0.0298227 0.040104 -0.0140035 -0.0233398 -0.1137242 -0.4941792 -0.0187505 0.0557802 0.0046321 -0.2682602 -0.0041531 -0.2095741 -0.0247523 -0.2104417 -0.2246216 -0.1412517 -0.010302 -0.0038909 0.0364958 -0.0176652 -0.0227408 0.0553552 -0.1100787 0.0314257 0.0813897 0.0144146 -0.0051261 0.0858129 0.0283938 0.0410245 0.0306415 -0.1515538 -0.0040765 0.002914 0.0060362 0.0072603 -0.0821757 0.0072139 -0.000501 0.0072696 -0.1669239 -0.010103 0.1169351 0.0115606 0.128164 -0.0818066 -0.0169008 0.0024576 -0.0108006 0.1423734 0.1268759 -0.1464258 -0.0240356 -0.0194331 -0.015718 -0.017155 -0.0333727 0.0078094 0.1171768 0.0977776 0.1613916 0.0014309 0.0408314 -0.0057496 -0.0039935 -0.0258146 -0.0350211 0.1166026 0.0103416 -0.1098616 -0.0064835 -0.1189417 -0.0981805 -0.0202958 -0.0170585 -0.0280934 0.141175 -0.1388458 -0.0090543 -0.002903 -0.0086443 0.1035464 -0.0038138 -0.0099605 -0.0038789 0.149751 1.6068083 0.0198283 -0.141926 0.0797323 1.7887607 0.1102702 -0.5844486 0.1015089 0.9774232 -0.8707734 -0.133047 0.0158734 -0.5680082 -1.4123728 0.1118921 0.3143371 0.4116687 -0.774667 -0.9273001 0.1446992 0.0676678 0.4892704 -1.1691565 -0.2249894 0.5204411 -0.5006812 -0.9641679 unknown
polarizability: 159.4391553|1.0968684|138.4289257|-3.9690981|7.5047894|53.869972 unknown
InChI: InChI=1/6C.2O.S.5H
charge -1 multiplicity 1
14 atoms
C  2.46799938 -1.200936 -0.09339845
C  1.06941682 -1.250878 -0.11694113
C  0.32598311 -0.07213702 -0.03305338
C  0.97577497 1.15934874 0.07878965
C  2.37382602 1.21439619 0.10005525
C  3.12190065 0.03321493 0.01091617
H  3.0523268 -2.12431488 -0.15068699
H  0.52944658 -2.19998284 -0.17944585
H  0.36901309 2.06491041 0.16923727
H  2.88472161 2.17751548 0.19290296
H  4.21436608 0.07449245 0.02802581
S  -1.54688106 -0.13598187 -0.14649216
O  -1.83094788 -1.5282622 0.42211306
O  -1.93922449 1.01006668 0.78930307
