program: Gaussian 16
title: Title Card Required
version: ES64L-G16RevA.03
frameworkgroup: C1[X(C4H4Se)]
method: RB3LYP
basis: def2SVP
operation: Freq
keyword: #N
keyword: Geom=AllCheck
keyword: Guess=TCheck
keyword: SCRF=Check
keyword: GenChk
keyword: RB3LYP/def2SVP
keyword: Freq
converged: YES YES YES YES
title: Mulliken charges:
elementType: C C C C H H H H Se
charge: -0.128667 0.025322 0.025322 -0.128667 0.029793 -0.003133 -0.003133 0.029793 0.153369
chargesum: -0.00000
title: Mulliken charges with hydrogens summed into heavy atoms:
elementType: C C C C Se
charge: -0.098873 0.022189 0.022189 -0.098873 0.153369
chargesum: 0.00000
1716.lowfreq: -0.0167 -0.0151 -0.0148 6.2888 10.2341 13.3959 405.3763 465.8022 560.3150
frequency: 405.3762 465.8022 560.3150 631.2882 689.0793 708.7356 770.7672 835.8868 897.2477 940.3524 1036.3026 1086.3341 1090.4774 1256.1964 1373.2024 1482.4239 1575.9202 3189.4220 3202.4033 3246.1981 3248.2979
redmass: 4.2633 9.2038 2.7942 5.9048 1.2929 1.1059 4.3679 3.9489 1.2418 1.3548 1.8589 1.0490 1.1571 1.3614 2.2100 7.0145 4.9400 1.0880 1.0947 1.0962 1.0998
irintensity: 2.5077 0.1172 0.0000 0.7449 0.0000 108.0866 19.2888 1.1933 0.1580 0.0000 2.3887 2.7340 1.7170 18.3342 1.1723 16.3719 0.2213 3.4776 4.1771 0.0000 1.3288
temp: 298.150 k
press: 1.00000 atm
elementType: 6 6 6 6 1 1 1 1 34
symmnumber: 1
zpe: 171616.4 jmol-1
zpe.correction: 0.065365 hartree
zpe.thermalcorrener: 0.069677 hartree
zpe.thermalcorrenthalpy: 0.070621 hartree
zpe.thermalcorrgfe: 0.036962 hartree
zpe.sumelectzpe: -2555.940290 hartree
zpe.sumelectthermal: -2555.935978 hartree
zpe.sumelectthermalent: -2555.935034 hartree
zpe.sumelectthermalfe: -2555.968694 hartree
dipole: -0.2289 0.0000 0.0000
dipole: 0.2289
quadrupole: -39.1235 -36.9409 -45.3242
quadrupole: -0.0000 -0.0001 0.0005
quadrupole: 1.3393 3.5219 -4.8613 -0.0000 -0.0001 0.0005
hfenergy: -2556.0056555 hartree
pointgroup: C01 [X(C4H4Se1)]
dipole: -0.0900409 -0.0000005 -0.0000016 debye
dipolederiv: 0.3015324 0.1591931 0.0000208 0.1841009 -0.080239 0.0000145 0.0000205 0.0000166 -0.2865891 -0.2172203 0.0095607 0.0000002 0.1792097 -0.000933 0.0000113 0.0000059 0.0000065 -0.1135228 -0.2172187 -0.0095626 -0.0000038 -0.1792115 -0.0009346 0.000005 -0.0000095 0.0000062 -0.1135228 0.3015353 -0.1591898 -0.0000003 -0.1840976 -0.080242 0.0000081 0. 0.000011 -0.2865892 0.0564616 -0.0351903 -0.0000043 0.0035262 -0.0118911 -0.00001 -0.0000017 -0.0000123 0.1638268 -0.0428991 -0.0827663 -0.0000091 -0.0465647 0.0482274 -0.0000075 -0.000004 -0.0000077 0.149144 -0.0429002 0.0827655 0.0000024 0.0465639 0.0482286 -0.0000059 -0.0000027 -0.0000048 0.149144 0.0564614 0.0351909 0.0000006 -0.0035256 -0.0118908 -0.0000101 -0.0000021 -0.0000111 0.1638268 -0.1957524 -0.0000012 -0.0000065 -0.0000012 0.0896745 -0.0000055 -0.0000065 -0.0000045 0.1742822 unknown
polarizability: 76.1497703|0.0000426|66.3772544|0.0007885|0.0020383|30.939589 unknown
InChI: InChI=1/4C.Se.4H
charge 0 multiplicity 1
9 atoms
C  -0.02015109 -1.29127351 -0.00007281
C  -1.26147568 -0.71743267 -0.00006984
C  -1.26148188 0.71742316 0.00002603
C  -0.02016227 1.29127474 0.00007228
H  0.21975219 -2.35363786 -0.00012849
H  -2.17983419 -1.30863006 -0.00012327
H  -2.17984552 1.30861258 0.00004738
H  0.21973185 2.35364114 0.00013633
Se 1.33511559 0.00000649 0.00002338
