program: Gaussian 16
title: Title Card Required
version: ES64L-G16RevA.03
frameworkgroup: C1[X(C16H18N3OS)]
method: RB3LYP
basis: def2SVP
operation: Freq
keyword: #N
keyword: Geom=AllCheck
keyword: Guess=TCheck
keyword: SCRF=Check
keyword: GenChk
keyword: RB3LYP/def2SVP
keyword: Freq
converged: YES YES NO NO
title: Mulliken charges:
elementType: C S N N C C C C H C H C H H C H H H N H C H H C H H C C C C H C H C H H H H O
charge: 0.144439 0.614529 -0.294839 -0.225147 -0.059553 0.054839 0.053417 -0.006443 0.044080 -0.013338 0.040638 -0.023462 0.023723 0.022863 0.081873 0.052414 0.032089 0.051881 -0.200582 0.214933 0.158827 0.063040 0.061862 0.088534 0.041844 0.032631 -0.059134 -0.040415 -0.025876 0.010775 0.002255 -0.001854 0.000042 -0.007530 0.007825 0.007938 0.007986 0.226374 -0.183479
chargesum: 1.00000
title: Mulliken charges with hydrogens summed into heavy atoms:
elementType: C S N N C C C C C C C N C C C C C C C C O
charge: 0.144439 0.614529 -0.294839 -0.225147 -0.059553 0.098919 0.094055 0.017280 0.009525 -0.023462 0.218256 0.240726 0.283728 0.163009 -0.059134 -0.038160 -0.025834 0.018601 0.006084 0.000457 -0.183479
1716.lowfreq: -5.8773 -2.6020 0.0004 0.0010 0.0011 13.0805 16.2374 19.0190 37.8224
frequency: 14.9564 17.8594 37.7160 49.1253 57.4358 86.5753 106.3861 113.3913 135.7849 156.3065 230.2899 239.0782 266.0396 286.8430 297.1464 331.6567 359.7675 365.9511 377.3525 402.4814 417.4901 422.7850 424.0457 471.2422 497.7698 509.6291 547.1575 566.5272 590.4712 634.0126 635.0996 643.7901 708.8969 714.2251 726.0593 732.4614 773.5143 781.2349 795.5866 799.4160 828.3454 833.8528 849.1108 875.4573 881.1658 908.0367 941.7800 955.1434 960.0991 998.4200 1001.5299 1003.8524 1014.1420 1015.9898 1016.5789 1022.9978 1036.3641 1048.1940 1051.6025 1053.1985 1069.1530 1086.6509 1097.4116 1137.2077 1156.2142 1157.3126 1182.0007 1191.0452 1198.2326 1228.9818 1244.2012 1311.7919 1313.0121 1326.1816 1344.7243 1368.1965 1370.6905 1385.7565 1389.1064 1430.0073 1435.8052 1440.0500 1453.5451 1454.9514 1481.2837 1508.0681 1526.7309 1529.8131 1577.9043 1618.5395 1640.2819 1640.8403 1662.1294 3037.1719 3068.3180 3092.3508 3107.4967 3124.9765 3147.1086 3162.1630 3172.3730 3173.6943 3183.9291 3194.6162 3200.1492 3205.0332 3206.2170 3233.0205 3233.6376 3450.2188 3565.7722
redmass: 4.4173 4.4542 4.5428 4.1857 1.0616 4.1589 4.7252 4.0878 6.0174 5.2633 3.9978 4.8972 5.1361 6.0966 3.2642 3.5747 2.2357 4.0241 1.8018 2.6562 3.0661 2.4636 2.5243 4.1540 2.7886 3.9956 2.0137 2.6650 3.3919 5.8960 5.9789 6.0368 5.6213 3.4524 1.6406 3.6544 2.1375 3.7174 5.1926 6.2005 4.7922 1.3815 1.2564 1.2932 5.0417 2.1031 3.9932 3.0425 1.7589 1.3196 1.5277 2.1048 1.3931 4.2604 1.4867 2.8646 1.3585 4.6729 2.0790 1.6675 1.4996 2.3731 1.4944 1.2138 1.1998 1.0777 1.1123 1.1309 1.2919 2.1806 2.7618 1.4151 1.2703 2.0300 1.2773 5.7854 2.4703 1.9155 2.0976 1.7837 1.0428 1.1796 1.1955 1.6407 2.3100 2.4421 2.4936 1.1012 8.7149 6.5640 6.0897 6.2811 6.2619 1.0384 1.0610 1.0608 1.1019 1.1076 1.1048 1.1086 1.0881 1.0903 1.0914 1.0959 1.0923 1.0924 1.0981 1.0946 1.0960 1.0464 1.1037
irintensity: 0.9328 0.3490 0.2344 0.4850 1.0516 0.3252 0.8759 1.2811 2.8915 2.4646 4.9856 3.3839 2.9126 1.2794 5.9022 1.6427 0.4180 3.9166 25.2900 17.8490 2.1250 2.6476 2.5509 100.5041 48.2462 12.8486 217.7862 69.1298 101.4813 3.1295 3.3652 2.6398 83.7993 15.1876 57.2979 45.2361 72.7239 6.3229 80.4461 48.7565 68.9091 35.3022 0.2489 3.9688 54.2514 10.8551 146.4465 55.8989 1.1732 0.4936 22.1031 2.9968 0.1676 0.2237 0.2483 10.1990 0.4097 21.2720 7.3525 17.5098 12.7889 406.5080 26.0920 13.1411 17.7597 1.8131 0.4329 3.8543 34.9635 4.6907 15.7875 15.9618 12.6985 65.6309 3.3033 1.7426 18.7457 23.0486 13.7957 7.9340 11.9226 20.8516 3.0274 49.5755 8.2345 6.7208 19.1894 126.3391 364.8939 15.4677 1.4752 170.9703 5.5108 5.0232 29.6185 2.2350 5.0487 10.4249 16.5147 0.5860 6.8712 8.0014 10.2246 23.3276 2.8198 2.3309 11.5863 11.9523 7.8238 370.1625 243.7083
temp: 298.150 k
press: 1.00000 atm
elementType: 6 16 7 7 6 6 6 6 1 6 1 6 1 1 6 1 1 1 7 1 6 1 1 6 1 1 6 6 6 6 1 6 1 6 1 1 1 1 8
symmnumber: 1
zpe: 826233.7 jmol-1
zpe.correction: 0.314696 hartree
zpe.thermalcorrener: 0.333910 hartree
zpe.thermalcorrenthalpy: 0.334854 hartree
zpe.thermalcorrgfe: 0.264613 hartree
zpe.sumelectzpe: -1256.928814 hartree
zpe.sumelectthermal: -1256.909600 hartree
zpe.sumelectthermalent: -1256.908656 hartree
zpe.sumelectthermalfe: -1256.978897 hartree
dipole: -2.7606 -6.0067 3.3165
dipole: 7.3960
quadrupole: -76.7683 -104.6861 -118.2766
quadrupole: -4.8332 0.0766 -14.3400
quadrupole: 23.1420 -4.7758 -18.3663 -4.8332 0.0766 -14.3400
hfenergy: -1257.2435098 hartree
pointgroup: C01 [X(C16H18N3O1S1)]
dipole: 0.5249952 -2.3550347 -1.6263835 debye
polarizability: 390.827147|17.2559211|217.2724084|3.1172982|-14.8315353|278.5247283 unknown
InChI: InChI=1/16C.3N.O.S.18H
charge 1 multiplicity 1
39 atoms
C  -2.37237009 -0.45418677 -0.22657507
S  -0.3675289 -1.64229246 -0.64766438
N  -1.39909745 -0.42645467 -1.09998581
N  -1.09296018 -2.11012277 0.72299007
C  1.29419813 -1.21851326 -0.29223368
C  1.61341849 -0.95355369 1.0458956
C  2.22419814 -1.05027164 -1.33243996
C  2.91036597 -0.54952389 1.34597753
H  0.86562821 -1.06894446 1.82972205
C  3.50350153 -0.62646069 -1.00102398
H  1.95265594 -1.23442118 -2.37157215
C  3.87071971 -0.37369045 0.33600696
H  3.17794177 -0.35295781 2.38606337
H  4.23801237 -0.48354448 -1.79679347
C  5.26185277 0.08352594 0.65849807
H  5.48836906 1.02669584 0.13421398
H  5.39876189 0.24027342 1.7372054
H  6.00175242 -0.6575107 0.31337757
N  -0.22282067 -2.51130739 -2.02769863
H  -1.12382182 -2.78124237 -2.43687702
C  -3.467728 0.54657773 -0.16861131
H  -4.38677754 0.05892869 0.1864157
H  -3.6305126 0.92650614 -1.18560382
C  -3.07550389 1.70858543 0.78694387
H  -3.86743109 2.46768136 0.70076959
H  -3.08127499 1.33654471 1.82202498
C  -1.72546529 2.29662558 0.45368671
C  -0.58521058 1.91931125 1.17852669
C  -1.56884879 3.14599502 -0.65284114
C  0.68300808 2.37667672 0.80720735
H  -0.69091828 1.25186567 2.03833948
C  -0.30343571 3.60421383 -1.02684911
H  -2.44843902 3.44375386 -1.2306389
C  0.82797722 3.21707038 -0.29966569
H  1.55978336 2.06992419 1.38106887
H  -0.19843802 4.26469315 -1.89149111
H  1.81891726 3.57159042 -0.5941659
H  0.46756255 -3.26933774 -1.99294323
O  -2.32327599 -1.37053591 0.72996049
