program: Gaussian 16
title: Title Card Required
version: ES64L-G16RevA.03
frameworkgroup: C1[X(C5H13N3S2Si)]
method: RB3LYP
basis: def2SVP
operation: Freq
keyword: #N
keyword: Geom=AllCheck
keyword: Guess=TCheck
keyword: SCRF=Check
keyword: GenChk
keyword: RB3LYP/def2SVP
keyword: Freq
converged: YES YES NO YES
title: Mulliken charges:
elementType: C S N N S C H H H H N Si C H H H C H H H C H H H
charge: -0.001608 0.605419 -0.296158 -0.539698 0.231360 0.010082 0.075697 0.076550 0.050469 0.075862 -0.515838 0.526497 -0.236646 0.041310 0.034116 0.039936 -0.204957 0.035608 0.051456 0.028610 -0.197462 0.030849 0.038548 0.039997
chargesum: -0.00000
title: Mulliken charges with hydrogens summed into heavy atoms:
elementType: C S N N S C N Si C C C
charge: 0.074255 0.605419 -0.296158 -0.539698 0.231360 0.212798 -0.515838 0.526497 -0.121285 -0.089283 -0.088067
chargesum: 0.00000
1716.lowfreq: -6.2136 -0.0033 -0.0031 -0.0028 1.3792 6.6263 34.2888 45.0511 67.2739
frequency: 34.2421 45.0457 67.2734 106.8318 154.2335 167.0590 172.2853 173.9832 191.2836 195.5164 213.3767 216.2138 236.9311 263.2722 286.2904 372.1975 385.9893 477.6531 495.0238 536.7216 602.1357 631.1590 677.6823 681.4148 688.7205 695.5404 717.9840 740.3679 769.1041 775.1347 813.6117 858.8747 860.1871 865.2177 871.8229 927.9328 944.3376 1005.1846 1231.5885 1252.0932 1265.8805 1268.7493 1274.9221 1308.5085 1420.9511 1422.8211 1423.7610 1432.3721 1432.5513 1435.5470 1442.3348 1452.3302 1560.5576 3025.0943 3025.8929 3027.9935 3061.8059 3113.4058 3114.9841 3117.5619 3122.0623 3122.5607 3125.8594 3163.7199 3190.5015 3193.8729
redmass: 3.8171 7.1010 4.1801 4.2507 1.0171 2.7075 2.2526 1.1037 1.3905 1.2757 1.8607 1.8751 2.8580 2.7839 3.4393 6.6614 5.0534 8.0018 6.8222 10.2858 3.9359 9.9914 8.3638 1.1816 2.1048 1.9999 3.7804 5.1976 1.5513 1.7465 3.6003 1.3740 1.6336 1.6910 1.7340 2.3171 1.8424 1.9183 1.2895 5.1814 1.2859 1.3231 1.2894 1.2615 1.0485 1.0508 1.0526 1.0500 1.0515 1.0485 1.0492 1.0470 9.8007 1.0353 1.0353 1.0354 1.0275 1.1018 1.1020 1.1018 1.1024 1.1021 1.1024 1.0933 1.1104 1.1093
irintensity: 0.1279 0.8807 2.8258 3.7065 0.0166 0.3375 0.9056 0.4518 1.0013 0.7026 1.7858 0.5433 6.2221 7.7589 17.3689 5.9404 11.3934 1.5528 34.7923 27.7467 6.3345 4.9719 20.3922 0.4345 4.4545 5.0372 11.7595 48.6598 23.0400 42.1136 48.3046 10.7784 93.4798 88.7951 258.8389 67.2109 22.0018 83.0625 22.2026 542.0235 47.8518 23.8914 69.2626 41.7800 7.0966 8.2616 0.1192 2.0912 0.6171 4.5699 1.9031 9.8160 160.9843 5.5660 4.3099 6.9242 0.4805 4.8953 4.1065 20.9712 3.3792 10.3905 5.2106 1.1509 0.9894 0.6145
temp: 298.150 k
press: 1.00000 atm
elementType: 6 16 7 7 16 6 1 1 1 1 7 14 6 1 1 1 6 1 1 1 6 1 1 1
symmnumber: 1
zpe: 478195.9 jmol-1
zpe.correction: 0.182135 hartree
zpe.thermalcorrener: 0.197356 hartree
zpe.thermalcorrenthalpy: 0.198300 hartree
zpe.thermalcorrgfe: 0.139727 hartree
zpe.sumelectzpe: -1447.705538 hartree
zpe.sumelectthermal: -1447.690317 hartree
zpe.sumelectthermalent: -1447.689373 hartree
zpe.sumelectthermalfe: -1447.747946 hartree
dipole: 1.9884 0.3733 0.8658
dipole: 2.2006
quadrupole: -82.7166 -83.8464 -93.0521
quadrupole: 2.2192 2.8418 -4.1803
quadrupole: 3.8217 2.6920 -6.5137 2.2192 2.8418 -4.1803
hfenergy: -1447.8876732 hartree
pointgroup: C01 [X(C5H13N3S2Si1)]
dipole: 0.5716884 0.5405819 0.3613261 debye
dipolederiv: 0.3166669 -0.4631816 0.1811756 -0.2859261 0.6692348 -0.3311646 0.1300715 -0.3732626 0.1584399 0.885834 0.6833642 0.1029686 0.6622934 2.3620906 0.3452775 -0.0845892 -0.1984833 1.8270252 -0.5687075 -0.2538932 0.0845067 0.0102569 -1.0919885 0.2249333 -0.1010304 0.3634666 -0.6165971 -0.5414323 0.1989584 -0.1643833 -0.2313273 -0.9137883 0.0993748 0.124616 0.1503659 -0.6374973 0.0389992 0.2617868 -0.1371006 0.2723374 0.0124804 0.0108519 -0.1508933 -0.0068654 0.0896065 -0.0244397 -0.1096706 -0.0150027 -0.0462369 -0.1776739 0.0358152 0.0270365 0.0426302 -0.3588749 0.0227271 -0.0170145 0.0019319 -0.0220176 0.0883621 -0.0064133 -0.0127611 0.0294335 0.0336682 0.0550096 0.0357281 -0.017392 0.0369599 0.052021 -0.0121153 0.0176749 0.00084 0.0022906 0.0725645 -0.0253224 -0.0134282 -0.0258361 -0.0178748 -0.0263138 -0.0064584 -0.0346917 -0.0007999 0.0287441 -0.0461421 0.031891 -0.0261235 0.0788714 0.0298388 0.0577783 0.0595521 0.1148152 -0.7029818 -0.4057815 -0.1784984 -0.4821749 -1.7907181 -0.621016 -0.2531253 -0.6641655 -1.3791415 1.519025 0.2091381 0.0896088 0.1742234 1.9501709 0.1873186 0.3181112 0.8896855 1.6551168 -0.381681 -0.0595252 0.0958516 -0.0634333 -0.4171894 0.0715337 0.0439701 -0.0788957 -0.413803 -0.1026918 -0.0043525 -0.0294709 -0.032221 0.0742015 0.0094146 0.0032484 0.0284611 0.0751708 0.090341 0.0212566 0.005065 0.0046293 0.0717093 -0.0621963 -0.0287831 -0.115267 -0.116201 0.0473326 -0.0152039 0.0073715 0.0212595 -0.0913317 0.0286116 -0.0040006 0.0666536 0.0879489 -0.5292657 0.0079273 -0.0593256 0.0567659 -0.3997421 0.0173407 -0.0743604 -0.1234958 -0.2668687 -0.0305157 -0.0501618 0.090249 -0.0438204 0.0514873 0.0306547 0.0706441 0.049196 0.0050377 0.0780653 0.0989444 0.0150403 0.0365828 -0.053317 0.0070529 0.0176131 0.0316509 0.0748693 0.0260162 -0.0843663 -0.0863831 -0.0296249 0.0580173 -0.0514792 -0.0651091 -0.0738355 -0.0842869 -0.3089511 0.0276087 -0.0032358 0.0287701 -0.566225 0.0197573 -0.029683 -0.0378538 -0.2514081 0.0636574 -0.014325 -0.0236609 -0.0379904 -0.0271961 -0.1037239 -0.0288197 -0.0821145 -0.0539274 -0.0848204 0.0425595 -0.0324383 0.083009 0.0610455 0.0172492 -0.0332566 0.0142546 0.0627866 0.0305039 -0.0383316 0.0546599 -0.0603551 0.0173526 0.0793977 0.0621061 0.0627406 -0.0073699 unknown
polarizability: 117.3354404|13.6770227|144.9191753|1.5630304|-2.179567|117.9329993 unknown
InChI: InChI=1/5C.3N.2S.Si.13H
charge 0 multiplicity 1
24 atoms
C  -0.62478466 0.6554551 -0.83115556
S  -2.31941852 -0.86205056 0.19956137
N  -0.64828413 -0.43171268 -0.14540801
N  -3.13759597 0.30915005 -0.52347211
S  -2.11428383 1.48293618 -1.20722384
C  -2.31997619 -0.67028459 1.98972767
H  -3.34204042 -0.88890475 2.3243194
H  -1.60605388 -1.39452789 2.40158952
H  -2.03249392 0.36311719 2.22057517
H  0.31735447 1.08851104 -1.19001996
N  -2.72489422 -2.30071723 -0.04028733
Si -3.07921786 -2.95177392 -1.64748707
C  -1.97432466 -2.1477781 -2.9465483
H  -0.91048426 -2.25760034 -2.68165194
H  -2.13027101 -2.60919586 -3.93583071
H  -2.19546147 -1.07206678 -3.03782935
C  -4.88589092 -2.61751468 -2.03697077
H  -5.54176754 -3.08408088 -1.28423201
H  -5.06933967 -1.53141934 -2.02160031
H  -5.16830541 -3.00879059 -3.02843941
C  -2.73555507 -4.7938227 -1.53677641
H  -2.96960238 -5.2989476 -2.48847311
H  -1.67590486 -4.98123924 -1.29985682
H  -3.34587822 -5.25646456 -0.74461222
