program: Gaussian 09
title: 000004549
version: EM64L-G09RevD.01
frameworkgroup: C1[X(C16H16N2O4)]
method: RPBEPBE
basis: SDD
operation: Freq
keyword: #p
keyword: freq=noraman
keyword: PBEPBE/SDD
title: #p freq=noraman PBEPBE/SDD
converged: YES YES NO NO
title: Mulliken charges:
elementType: O O O O N N C C C C C C C C C C C C C C C C H H H H H H H H H H H H H H H H
charge: -0.428212 -0.313250 -0.225849 -0.221057 -0.403268 0.013015 -0.448756 -0.363137 -0.544681 0.498667 0.313485 0.108659 -0.313222 -0.413861 -0.408548 -0.457582 0.420628 -0.388471 -0.226442 -0.227921 -0.240348 0.149873 0.232513 0.234083 0.224442 0.225040 0.207133 0.207565 0.381082 0.257401 0.231456 0.231139 0.326236 0.286800 0.226282 0.226267 0.230082 0.392756
chargesum: 0.00000
title: Mulliken charges with hydrogens summed into heavy atoms:
elementType: O O O O N N C C C C C C C C C C C C C C C C
charge: -0.035456 -0.313250 -0.225849 -0.221057 -0.022186 0.013015 0.017840 0.086345 -0.129983 0.498667 0.313485 0.108659 -0.055821 -0.182405 -0.177408 -0.131346 0.420628 -0.101671 -0.000160 -0.001654 -0.010265 0.149873
polarizability: 3.40963786e+02 3.48334070e+01 1.96367506e+02 -2.17084975e+00 1.49896187e+00 1.30514337e+02
1716.lowfreq: -11.5623 -5.6302 -0.0010 -0.0005 0.0007 4.7860 7.7833 16.8811 30.0258
frequency: 6.2445 16.6759 29.9937 39.5255 60.6745 77.0551 83.3503 86.2181 117.8412 147.0296 156.3485 178.5237 191.0275 214.3477 288.6706 309.4867 317.1184 331.8482 361.4505 400.6452 403.7763 428.0132 438.9033 496.7669 510.5088 512.0785 569.8988 579.5255 591.8589 618.1745 624.0310 644.7044 667.5632 705.4937 712.1967 730.6961 749.6694 756.1584 759.0260 798.5371 801.5272 813.6269 828.2558 852.6339 863.7871 886.8367 918.1426 971.0690 976.4294 990.0455 992.6388 995.1032 1010.4067 1025.6896 1034.9837 1042.7855 1063.3671 1084.5663 1098.3006 1100.8654 1138.9005 1157.6157 1169.8032 1173.1044 1187.1884 1215.9213 1217.7012 1248.1509 1265.9209 1268.0506 1289.4345 1307.0024 1328.0499 1333.4232 1350.3760 1355.0274 1366.4961 1383.1171 1407.4928 1441.1074 1441.6904 1457.4136 1468.8174 1477.6927 1484.7974 1491.2860 1529.9296 1581.8416 1594.2716 1603.2356 1615.3799 1639.5440 2941.3565 2974.6676 2985.1361 2988.1637 3023.5425 3056.5001 3114.0824 3114.8416 3132.2772 3144.6916 3163.2094 3167.2316 3185.9041 3191.7923 3318.6000 3535.1652
redmass: 3.8758 5.5517 6.4346 3.8203 9.9605 4.9865 6.0833 3.7041 2.8615 7.5316 4.7788 7.1802 3.7858 4.6769 6.7340 5.8824 5.0361 2.3845 9.4216 5.9199 2.8182 5.5833 3.1667 8.1695 3.2175 3.3162 5.0208 1.2236 4.2996 6.3576 6.1585 6.1918 5.7169 1.7392 6.9587 8.4388 1.6130 1.2137 2.0288 1.6784 4.2725 4.4352 1.6065 1.2514 1.2918 7.2844 1.4437 1.4327 1.3886 6.3026 1.3301 1.3175 4.0884 2.4841 3.4873 1.5537 3.5200 2.2868 2.5104 1.4510 2.6265 1.4284 1.2175 1.0609 1.1151 2.4562 4.1887 1.6108 1.2432 1.4684 1.0809 1.7624 1.2567 1.5346 3.1029 4.2417 1.6262 7.8425 5.9237 2.1779 3.1669 3.5267 1.0979 1.0969 2.2771 1.0983 4.3290 7.6076 6.0511 2.8327 6.1023 6.4656 1.0572 1.0590 1.1031 1.0591 1.1015 1.1052 1.0884 1.0866 1.0903 1.0956 1.1015 1.0877 1.0967 1.0925 1.0803 1.0643
irintensity: 0.0681 1.0778 0.5120 0.1192 0.0627 1.2940 0.8202 0.5277 0.0983 1.4854 0.5754 0.6811 4.1469 3.6312 1.9757 1.9021 0.2026 0.0644 4.1960 14.7000 0.0735 4.3666 11.1156 10.0440 6.0372 11.7846 9.9225 123.9328 4.3913 0.0454 30.4435 20.9729 51.2101 53.8049 1.9730 19.7531 18.1503 0.3842 45.1911 81.1985 2.3684 1.7090 28.7843 0.1893 1.3917 4.9078 2.3315 17.7548 0.0037 0.3804 0.3315 0.3115 180.1831 8.8593 20.5780 3.1288 9.0362 112.8044 26.8955 7.3285 40.8947 103.9122 1.0793 0.3770 0.6978 47.0445 686.1768 39.5199 0.4744 12.4647 0.3439 26.2303 0.6803 30.4111 26.0956 247.5044 0.9043 0.0225 2.7056 6.9783 42.5593 30.6194 6.9235 21.7705 22.0166 39.1453 139.4042 119.1738 1.5490 149.7125 10.1631 574.4442 41.8494 17.2418 20.8542 38.6597 1.3680 46.7098 7.1995 13.9980 8.8858 41.6176 24.2562 3.1468 4.7074 12.3876 158.7177 71.4712
temp: 298.150 k
press: 1.00000 atm
elementType: 8 8 8 8 7 7 6 6 6 6 6 6 6 6 6 6 6 6 6 6 6 6 1 1 1 1 1 1 1 1 1 1 1 1 1 1 1 1
symmnumber: 1
zpe: 772127.6 jmol-1
zpe.correction: 0.294088 hartree
zpe.thermalcorrener: 0.314055 hartree
zpe.thermalcorrenthalpy: 0.314999 hartree
zpe.thermalcorrgfe: 0.240663 hartree
zpe.sumelectzpe: -1028.067159 hartree
zpe.sumelectthermal: -1028.047192 hartree
zpe.sumelectthermalent: -1028.046248 hartree
zpe.sumelectthermalfe: -1028.120584 hartree
dipole: 7.7006 0.4691 -0.0405
dipole: 7.7149
quadrupole: -177.7164 -122.0484 -123.1506
quadrupole: -9.8552 0.0517 0.5341
quadrupole: -36.7446 18.9234 17.8212 -9.8552 0.0517 0.5341
hfenergy: -1028.3612468 hartree
pointgroup: C01 [X(C16H16N2O4)]
dipole: -3.0295053 0.1864554 0.0179202 debye
polarizability: 340.9172352|-34.9276455|196.4058721|-2.2739037|-1.575679|130.5225208 unknown
InChI: InChI=1S/C16H16N2O4/c19-16(20)14-11-13(18(21)22)8-9-15(14)17-10-4-7-12-5-2-1-3-6-12/h1-3,5-6,8-9,11,17,19H,4,7,10H2
charge 0 multiplicity 1
38 atoms
O  3.070882 3.300584 0.032505
O  0.830767 2.722982 0.048951
O  6.182765 -2.155899 -0.017222
O  6.61797 0.08805 -0.008955
N  0.214041 0.112723 0.040855
N  5.800137 -0.916477 -0.007625
C  -2.226573 -0.283685 0.041726
C  -0.826433 -0.92639 0.034008
C  -3.352919 -1.351158 0.002968
C  -4.739589 -0.722161 0.004427
C  1.560246 -0.131728 0.02971
C  2.520694 0.961778 0.028032
C  2.072225 -1.476111 0.018445
C  -5.422918 -0.470812 1.221926
C  -5.360272 -0.336764 -1.211803
C  3.906033 0.685746 0.015778
C  4.359557 -0.642942 0.005271
C  3.442459 -1.729266 0.006665
C  -6.691831 0.151658 1.226056
C  -6.62885 0.285676 -1.213357
C  -7.299003 0.533052 0.007244
C  2.047324 2.353941 0.037553
H  -2.331289 0.390307 -0.830902
H  -2.345524 0.342616 0.947135
H  -0.716732 -1.568809 -0.865347
H  -0.713529 -1.585598 0.920583
H  -3.221439 -1.97515 -0.903163
H  -3.240894 -2.023475 0.876401
H  -0.06018 1.110388 0.048551
H  1.373535 -2.315932 0.019731
H  -4.961138 -0.770138 2.171515
H  -4.849421 -0.531871 -2.163474
H  4.626946 1.506524 0.014082
H  3.833992 -2.750201 -0.001496
H  -7.207435 0.334528 2.175658
H  -7.095532 0.572673 -2.162478
H  -8.28413 1.012666 0.008257
H  2.669358 4.210277 0.039187
