program: Gaussian 16
title: Title Card Required
version: ES64L-G16RevA.03
frameworkgroup: C1[X(C6H7NO2S)]
method: RB3LYP
basis: def2SVP
operation: Freq
keyword: #N
keyword: Geom=AllCheck
keyword: Guess=TCheck
keyword: SCRF=Check
keyword: GenChk
keyword: RB3LYP/def2SVPFreq
converged: YES YES NO YES
title: Mulliken charges:
elementType: C C C C C C H H H H H S O O N H H
charge: -0.001654 0.022602 -0.094351 0.030147 -0.003776 0.026547 0.021922 0.014391 0.014652 0.022394 0.022593 0.857532 -0.488714 -0.506262 -0.275065 0.170579 0.166464
chargesum: -0.00000
title: Mulliken charges with hydrogens summed into heavy atoms:
elementType: C C C C C C S O O N
charge: 0.020268 0.036993 -0.094351 0.044799 0.018618 0.049141 0.857532 -0.488714 -0.506262 0.061978
chargesum: 0.00000
1716.lowfreq: -18.7232 -10.5136 0.0027 0.0036 0.0039 11.7296 30.4632 115.4911 181.1366
frequency: 22.8451 115.4143 181.1245 192.2911 305.0969 312.7412 337.1468 415.7722 428.6508 467.1239 533.8164 545.8579 625.7362 674.6535 712.6308 716.3585 773.8673 862.0124 867.3729 956.0992 1013.8648 1014.8956 1042.0150 1045.1792 1081.7353 1090.9115 1093.5493 1145.7075 1158.9174 1172.7124 1309.0978 1315.6671 1372.7338 1473.4239 1502.8286 1535.9106 1642.1483 1645.7057 3189.1632 3197.9364 3205.8113 3213.0792 3220.8440 3467.6214 3566.1279
redmass: 4.7855 3.8570 3.1464 1.7510 4.8492 3.3512 5.3816 2.8594 4.9145 5.6927 4.8202 5.9501 6.3819 2.7773 1.9545 4.5312 1.6774 1.2854 2.1571 1.3622 1.3895 6.1779 2.0792 1.4352 1.7843 1.4895 2.2331 3.8688 1.0755 1.2280 6.4209 1.4904 8.5739 2.3572 2.2615 1.0966 6.1651 6.5428 1.0877 1.0910 1.0955 1.0977 1.0956 1.0482 1.0975
irintensity: 2.7451 13.0829 9.2047 47.5373 18.7155 11.1837 3.6669 1.1470 26.5614 21.1026 44.4034 192.6456 0.3171 322.4588 44.9069 34.8952 23.2208 14.5172 203.1779 0.4828 0.1369 3.1654 6.7343 0.8170 53.4095 32.9855 22.7631 280.4153 0.4002 15.5866 304.7651 13.1965 2.0908 32.9430 5.8459 61.1048 5.1158 0.0481 0.3887 9.0898 5.6519 3.8644 3.9016 105.8921 104.9273
temp: 298.150 k
press: 1.00000 atm
elementType: 6 6 6 6 6 6 1 1 1 1 1 16 8 8 7 1 1
symmnumber: 1
zpe: 333544.0 jmol-1
zpe.correction: 0.127040 hartree
zpe.thermalcorrener: 0.136104 hartree
zpe.thermalcorrenthalpy: 0.137048 hartree
zpe.thermalcorrgfe: 0.091788 hartree
zpe.sumelectzpe: -835.658642 hartree
zpe.sumelectthermal: -835.649578 hartree
zpe.sumelectthermalent: -835.648634 hartree
zpe.sumelectthermalfe: -835.693894 hartree
dipole: 3.1327 0.1178 4.0457
dipole: 5.1182
quadrupole: -55.4170 -64.2484 -65.7868
quadrupole: -1.7687 -10.0077 -0.6152
quadrupole: 6.4004 -2.4310 -3.9694 -1.7687 -10.0077 -0.6152
hfenergy: -835.7856819 hartree
pointgroup: C01 [X(C6H7N1O2S1)]
dipole: -1.2710822 0.0796434 1.5597371 debye
dipolederiv: -0.1048946 -0.2261447 0.015067 -0.0900421 -0.0029447 -0.0091141 -0.0007512 -0.0105057 -0.1307488 -0.0337564 0.2185798 -0.0328917 -0.1651168 -0.0872567 -0.0153311 -0.0042707 -0.0095991 -0.0605925 -0.5044942 -0.0339571 0.0240959 -0.048932 -0.1258892 -0.007285 0.1103552 -0.0191533 -0.2990205 -0.0477531 -0.1942658 -0.0036419 0.1299821 -0.0685773 0.0065209 -0.0430482 0.0092297 -0.0592241 -0.1248748 0.2097252 -0.0161146 0.0701085 0.0324351 -0.0165793 -0.0052442 -0.0093815 -0.1352049 0.1292263 0.0013178 -0.0122027 0.0035117 0.0581595 -0.0120725 -0.0048239 -0.0146659 -0.1022255 0.0376308 0.0829503 -0.0090405 0.0836033 -0.0173707 0.0139195 -0.0035764 0.0143155 0.1498611 0.1261988 -0.0934167 0.0136017 -0.0357691 0.0710955 0.0014637 0.0035926 0.0095512 0.1387959 0.0910419 0.0947538 -0.0036575 0.0507643 0.0712389 0.0127167 -0.0034704 0.0003912 0.1428822 0.055047 -0.0740451 0.0041622 -0.0755405 -0.0331781 0.0154214 0.0101235 0.0137299 0.1501164 -0.0753336 -0.0090247 0.0026522 -0.0089697 0.1173446 0.0025831 0.0027457 0.0024421 0.144891 3.2999847 0.050341 0.1698716 -0.0342564 2.3421981 -0.071036 0.2896884 -0.0599318 2.6136397 -1.1236312 -0.1962048 0.0248403 -0.3080038 -1.2384705 0.2838902 0.0080603 0.1479168 -0.8606894 -1.1840248 0.1667798 0.1045594 0.3339769 -1.0150209 -0.2887465 0.0979872 -0.1893237 -0.9315443 -1.037265 -0.0293051 -0.1809316 0.1468682 -0.6626228 0.1783141 -0.4294072 0.1591345 -1.2669553 0.2380893 0.0079975 0.0178175 -0.1204597 0.3409316 -0.099506 -0.0080372 -0.0605136 0.2046542 0.258809 0.0239189 -0.1181874 0.0682751 0.2179275 0.0048408 -0.0199236 0.0163636 0.3013648 unknown
polarizability: 154.6084762|-2.3759986|135.343626|3.3014632|-4.9582763|70.0534445 unknown
InChI: InChI=1/6C.N.2O.S.7H
charge 0 multiplicity 1
17 atoms
C  -2.50360406 1.19121719 -0.10076859
C  -1.10801115 1.26874234 -0.12622962
C  -0.36891942 0.08888263 -0.03278565
C  -0.98340067 -1.16271468 0.07694868
C  -2.37656675 -1.22527458 0.10160042
C  -3.13455983 -0.05070353 0.01369247
H  -3.09757624 2.10514577 -0.1727513
H  -0.59542508 2.22681512 -0.22033806
H  -0.37922726 -2.06933844 0.14033826
H  -2.87412538 -2.19401619 0.18664357
H  -4.225597 -0.10648549 0.0327336
S  1.4167346 0.16859388 -0.07352193
O  1.79919595 1.53534628 -0.45738541
O  1.93548443 -0.96986986 -0.84316914
N  1.80064445 -0.16179009 1.52842759
H  2.75772601 -0.52555602 1.57108869
H  1.72053687 0.68062409 2.10502939
