program: Gaussian 16
title: Title Card Required
version: ES64L-G16RevA.03
frameworkgroup: C1[X(C2H5N3O2S)]
method: RB3LYP
basis: def2SVP
operation: Freq
keyword: #N
keyword: Geom=AllCheck
keyword: Guess=TCheck
keyword: SCRF=Check
keyword: GenChk
keyword: RB3LYP/def2SVPFreq
converged: YES YES NO NO
title: Mulliken charges:
elementType: C S N N O O C H H H N H H
charge: 0.204256 0.669278 -0.374699 -0.290848 -0.439142 -0.220584 0.000003 0.080482 0.076148 0.054271 -0.061168 0.149656 0.152349
chargesum: 0.00000
title: Mulliken charges with hydrogens summed into heavy atoms:
elementType: C S N N O O C N
charge: 0.204256 0.669278 -0.374699 -0.290848 -0.439142 -0.220584 0.210903 0.240837
chargesum: -0.00000
1716.lowfreq: -3.7512 -0.0028 -0.0022 -0.0018 1.3536 2.8907 74.7210 171.3656 207.1406
frequency: 74.7206 171.3656 207.1406 239.0186 255.2027 293.3647 332.3401 422.4672 441.8429 470.7560 553.6820 682.7257 717.2328 761.6560 775.4932 848.5625 909.2641 948.7181 971.7141 1042.2987 1116.0686 1258.3015 1314.8565 1421.9117 1426.5881 1459.5929 1565.0361 1693.3943 3062.9170 3182.1115 3201.2856 3609.3818 3741.0208
redmass: 5.5908 1.3411 7.0443 2.6186 1.1750 3.6117 4.3829 3.8337 5.3665 1.1525 5.5395 7.9476 10.4646 8.8432 7.8271 6.9783 5.8189 1.4944 1.3749 3.2850 2.7998 9.6056 1.2642 1.0519 1.0585 3.4336 1.4711 5.8657 1.0283 1.1078 1.1112 1.0457 1.1063
irintensity: 9.1060 2.4859 2.1766 10.8528 232.8853 3.1852 0.1086 22.9604 26.2441 0.7920 24.7606 8.7824 9.5115 9.6750 77.7716 110.8262 13.6452 11.3422 13.9358 23.0645 23.0351 261.8426 17.8326 6.0118 13.7616 101.3033 46.1122 632.7587 0.1963 0.6925 0.0233 128.8350 92.6147
temp: 298.150 k
press: 1.00000 atm
elementType: 6 16 7 7 8 8 6 1 1 1 7 1 1
symmnumber: 1
zpe: 234300.8 jmol-1
zpe.correction: 0.089240 hartree
zpe.thermalcorrener: 0.097507 hartree
zpe.thermalcorrenthalpy: 0.098451 hartree
zpe.thermalcorrgfe: 0.056442 hartree
zpe.sumelectzpe: -791.473886 hartree
zpe.sumelectthermal: -791.465620 hartree
zpe.sumelectthermalent: -791.464675 hartree
zpe.sumelectthermalfe: -791.506684 hartree
dipole: 3.1356 -2.3780 2.4939
dipole: 4.6590
quadrupole: -36.5425 -57.9612 -55.2125
quadrupole: -2.1263 -7.7857 -1.1127
quadrupole: 13.3629 -8.0558 -5.3071 -2.1263 -7.7857 -1.1127
hfenergy: -791.5631263 hartree
pointgroup: C01 [X(C2H5N3O2S1)]
dipole: 1.18678 -0.8944669 1.0729909 debye
dipolederiv: 2.1562117 -0.1082911 0.1436076 -0.0382938 0.9990737 0.0378816 0.1767995 0.0286056 0.3261589 2.4885677 0.1720373 0.0960945 0.1597208 1.0898335 -0.0277514 0.2113281 -0.0512632 1.7302411 -1.6557385 0.0172527 -0.0563367 -0.2357926 -0.634751 -0.0179315 -0.1595571 0.0289636 -0.4938432 -0.3119492 0.0206346 0.0423571 -0.2577215 -0.4257828 0.017922 -0.0347449 -0.0196251 -0.4106922 -0.890083 -0.1188711 -0.2419809 -0.1247043 -0.4729804 -0.1103718 -0.222204 -0.0201309 -1.0347948 -0.681673 -0.1649588 -0.005325 0.2750744 -0.7459861 -0.0121702 0.0247177 -0.0264251 -0.1477512 -0.2304298 -0.0552966 0.0661262 -0.0250785 -0.0753385 0.050878 0.0312101 0.0029215 -0.1740373 0.0330982 0.02088 0.0130644 0.0210462 0.0503121 0.0194375 0.0334368 0.0350585 0.0653907 0.0475833 -0.0416991 0.0294455 -0.0451841 0.0186205 -0.0017311 0.0560953 -0.0083015 0.0352566 0.0210769 -0.0131136 -0.0084311 -0.0259647 0.0752336 0.0125195 -0.0135882 0.0045304 -0.0120214 -1.4399441 0.2771607 -0.0735314 0.3354869 -0.3162531 0.0545006 -0.2183125 0.0759004 -0.5333633 0.2734049 0.0543506 0.0072042 0.0792263 0.1743765 -0.0056091 0.0730113 -0.0090383 0.3308522 0.1898746 -0.0600855 -0.0122944 -0.1178149 0.2636422 -0.0175742 0.0418079 -0.0411958 0.3186039 unknown
polarizability: 84.7488299|0.156257|52.8608099|1.9054742|0.566008|45.5297166 unknown
InChI: InChI=1/2C.3N.2O.S.5H
charge 0 multiplicity 1
13 atoms
C  1.4642481 -0.16203174 0.19822053
S  -0.87007401 -0.01539259 -0.14520475
N  0.45645657 -0.99064069 0.07323237
N  -0.19826401 1.4303112 0.18681814
O  -1.62559284 -0.23357739 -1.38165864
O  1.22925318 1.1440085 0.23382876
C  -2.01055131 -0.41713028 1.18470035
H  -2.81548169 0.32849571 1.13420099
H  -2.4082748 -1.42164929 0.98992754
H  -1.47614146 -0.36026352 2.13952019
N  2.75301623 -0.53427267 0.30398422
H  3.47230948 0.17677051 0.28719613
H  2.99544637 -1.49495217 0.10457674
