program: Gaussian 16
title: Title Card Required
version: ES64L-G16RevA.03
frameworkgroup: C1[X(C2H5N3OS)]
method: RB3LYP
basis: def2SVP
operation: Freq
keyword: #N
keyword: Geom=AllCheck
keyword: Guess=TCheck
keyword: SCRF=Check
keyword: GenChk
keyword: RB3LYP/def2SVPFreq
converged: YES YES YES YES
title: Mulliken charges:
elementType: C S N N O C H H H H N H
charge: 0.184352 0.671017 -0.372775 -0.363812 -0.445103 -0.001456 0.076937 0.076452 0.050968 0.039469 -0.067677 0.151627
chargesum: 0.00000
title: Mulliken charges with hydrogens summed into heavy atoms:
elementType: C S N N O C N
charge: 0.223821 0.671017 -0.372775 -0.363812 -0.445103 0.202901 0.083951
1716.lowfreq: -3.6157 -0.0029 -0.0014 -0.0007 4.2808 6.5442 136.8935 175.2554 229.9461
frequency: 136.8934 175.2554 229.9461 312.2298 359.8611 398.6238 436.5558 583.5339 598.9354 692.9839 764.1131 834.0238 856.7030 916.0579 963.7650 972.0489 1048.4240 1194.3080 1253.4254 1285.4953 1313.9328 1420.7895 1429.1998 1459.7321 1564.3806 3062.3220 3183.4538 3198.0410 3218.1378 3638.9852
redmass: 3.9864 1.3289 2.7283 3.5943 4.6490 1.6073 9.4185 3.3368 3.0409 8.8204 7.8489 7.9958 1.3789 1.9459 3.0615 1.3729 3.1322 1.5438 6.5080 1.8784 1.2707 1.0501 1.0544 2.1488 6.6824 1.0282 1.1079 1.1111 1.0968 1.0816
irintensity: 10.8879 3.5159 1.9263 8.8454 9.6859 113.0858 17.2287 10.0556 3.4880 31.2165 27.9224 131.2412 9.1160 7.0837 12.7634 8.8825 49.5949 10.2363 181.2553 99.3302 18.6147 5.3997 7.1908 13.7559 158.6440 0.2769 0.4812 0.1184 2.3484 101.6033
temp: 298.150 k
press: 1.00000 atm
elementType: 6 16 7 7 8 6 1 1 1 1 7 1
symmnumber: 1
zpe: 224312.7 jmol-1
zpe.correction: 0.085436 hartree
zpe.thermalcorrener: 0.092301 hartree
zpe.thermalcorrenthalpy: 0.093245 hartree
zpe.thermalcorrgfe: 0.054623 hartree
zpe.sumelectzpe: -716.322696 hartree
zpe.sumelectthermal: -716.315832 hartree
zpe.sumelectthermalent: -716.314887 hartree
zpe.sumelectthermalfe: -716.353510 hartree
dipole: 2.7828 0.2976 2.9005
dipole: 4.0305
quadrupole: -34.9347 -52.3613 -50.1767
quadrupole: 0.5822 -5.6492 -0.2270
quadrupole: 10.8896 -6.5371 -4.3525 0.5822 -5.6492 -0.2270
hfenergy: -716.4081325 hartree
pointgroup: C01 [X(C2H5N3O1S1)]
dipole: 1.0808311 1.1331621 0.2495441 debye
dipolederiv: 0.5396897 0.1586236 -0.3843607 0.2295423 0.157198 -0.2078049 -0.5399775 -0.1822773 0.5437518 2.4331025 0.0509073 -0.0046719 0.1664621 1.6279914 0.2915564 0.0495019 0.293212 0.8115227 -1.1391549 -0.0735555 0.2861867 -0.0730938 -0.4771964 -0.0084487 -0.0575824 0.0261978 -0.5730257 -0.6938591 0.14781 -0.2230369 -0.1152991 -0.4418693 0.0365062 0.2070384 0.0321074 -0.5890186 -0.9695166 -0.272447 -0.0517719 -0.2202488 -0.9851641 -0.1880091 -0.0467086 -0.1477397 -0.4134168 -0.2686381 0.0857168 0.04517 0.0473458 -0.1609102 -0.0365548 -0.0067295 -0.0614822 -0.0278956 0.0406821 0.0218322 -0.0101293 0.0519561 0.0672464 -0.0256594 -0.0163073 -0.0038207 0.0250205 0.0358575 0.0165557 0.0345775 0.0349556 0.02959 0.0252651 0.0545677 0.0049006 0.046868 0.0112767 -0.0102219 -0.0046509 -0.0134462 -0.0116689 -0.0267651 0.003743 -0.0323562 0.0676674 -0.0147328 0.0044683 -0.0358139 0.0076964 0.13925 0.0284167 -0.0096334 0.0021334 0.1238321 -0.17929 -0.1512988 0.4099663 -0.1831203 -0.2603624 0.1493226 0.4297224 0.0492415 -0.2572218 0.2045828 0.0216091 -0.0614651 0.0672501 0.3158952 -0.0378251 -0.0676348 0.0198835 0.2419161 unknown
polarizability: 74.3570393|0.3371036|44.8491087|0.5486231|-2.4765199|52.3800738 unknown
InChI: InChI=1/2C.3N.O.S.5H
charge 0 multiplicity 1
12 atoms
C  1.75161302 -0.081919 0.68574602
S  -0.50333165 -0.1633467 -0.07216157
N  0.55776189 -0.3039891 1.20927683
N  0.51340993 0.42338763 -1.19242425
O  -1.34333997 -1.32843532 -0.36759738
C  -1.66289364 1.13785852 0.36710204
H  -2.2815799 1.31627866 -0.52259378
H  -2.27926725 0.75928002 1.19296949
H  -1.10345558 2.03612279 0.65177279
H  2.68219773 -0.2214526 1.2407203
N  1.76266277 0.318714 -0.58757138
H  2.57771051 0.39049068 -1.18625524
