program: Gaussian 16
title: Title Card Required
version: ES64L-G16RevA.03
frameworkgroup: C1[X(C3H7N3O3S2)]
method: RB3LYP
basis: def2SVP
operation: Freq
keyword: #N
keyword: Geom=AllCheck
keyword: Guess=TCheck
keyword: SCRF=Check
keyword: GenChk
keyword: RB3LYP/def2SVPFreq
converged: YES YES NO YES
title: Mulliken charges:
elementType: C S N N O C H H H H N S O O C H H H
charge: 0.260426 0.560332 -0.279180 -0.264772 -0.181767 -0.001154 0.123201 0.091152 0.069762 0.080995 -0.508444 0.819911 -0.446312 -0.501215 -0.025727 0.063500 0.066543 0.072750
chargesum: -0.00000
title: Mulliken charges with hydrogens summed into heavy atoms:
elementType: C S N N O C N S O O C
charge: 0.341421 0.560332 -0.279180 -0.264772 -0.181767 0.282960 -0.508444 0.819911 -0.446312 -0.501215 0.177066
1716.lowfreq: -5.2181 -0.0019 -0.0013 0.0021 0.8556 5.3116 47.7316 61.1311 113.8968
frequency: 47.7306 61.1306 113.8964 155.7184 178.7265 224.3002 243.9561 253.9180 274.1592 298.1035 336.5859 359.4024 417.5725 502.4415 508.6496 544.0723 565.3482 677.9955 688.6623 739.8609 777.9366 783.7549 845.0366 913.2993 924.8493 965.3203 975.5845 981.1291 986.5808 1076.6244 1136.7432 1223.3214 1288.5263 1304.7895 1324.9055 1340.9382 1412.7789 1426.7273 1429.1195 1437.2859 1591.4729 3057.1081 3058.2870 3180.4154 3183.2080 3191.9594 3213.4380 3223.5653
redmass: 6.0500 5.8371 6.7238 1.5580 3.0951 2.7870 1.4094 2.0120 3.8525 7.4120 4.6871 5.1685 6.7597 8.3342 7.0125 4.1229 6.4879 8.8470 7.5676 8.3614 7.7073 9.1270 8.2907 3.8901 1.5386 1.4497 1.5962 1.3545 1.5008 7.1117 10.8895 2.4910 1.8107 1.3007 1.2470 6.2675 1.0577 1.0499 1.0634 1.0493 7.8099 1.0286 1.0268 1.1096 1.1082 1.1097 1.1128 1.0976
irintensity: 4.4027 3.6763 4.9761 2.6421 4.5402 1.8167 0.2253 0.9427 2.3735 2.0965 7.7554 2.3441 2.2253 48.1403 64.7654 69.5549 28.6116 25.7205 15.5744 59.7733 90.6774 59.5632 21.6374 9.6357 7.8882 54.9394 24.8032 10.5508 56.2649 758.1528 120.2888 53.0730 10.3622 79.2642 19.9614 193.8052 3.8299 10.4840 7.1194 5.2353 152.8858 0.7356 12.3136 0.5070 23.5408 0.5402 5.1011 4.2171
temp: 298.150 k
press: 1.00000 atm
elementType: 6 16 7 7 8 6 1 1 1 1 7 16 8 8 6 1 1 1
symmnumber: 1
zpe: 319683.7 jmol-1
zpe.correction: 0.121761 hartree
zpe.thermalcorrener: 0.133360 hartree
zpe.thermalcorrenthalpy: 0.134304 hartree
zpe.thermalcorrgfe: 0.083758 hartree
zpe.sumelectzpe: -1303.860547 hartree
zpe.sumelectthermal: -1303.848948 hartree
zpe.sumelectthermalent: -1303.848004 hartree
zpe.sumelectthermalfe: -1303.898551 hartree
dipole: -4.6888 -0.3678 0.6265
dipole: 4.7447
quadrupole: -77.9133 -68.9110 -86.9578
quadrupole: -6.1134 7.7913 2.3835
quadrupole: 0.0141 9.0164 -9.0304 -6.1134 7.7913 2.3835
hfenergy: -1303.9823085 hartree
pointgroup: C01 [X(C3H7N3O3S2)]
dipole: -1.603125 0.9560188 0.0262279 debye
dipolederiv: 0.7864512 0.157104 -0.2825133 0.2576939 0.2895229 -0.2067942 -0.410888 -0.150476 0.516498 2.2605539 -0.5445567 0.2212764 -0.6032694 1.8268073 0.1585262 -0.2784219 0.6671099 0.6981491 -1.044552 0.0214164 0.0358432 0.069944 -0.5415135 0.071325 -0.0165117 -0.0077593 -0.3940533 -0.4307792 0.0973164 -0.1022736 0.0392167 -0.4100383 -0.0123689 0.2724715 -0.0540622 -0.2580506 -0.5752735 -0.114061 0.1650505 -0.1739612 -0.2464316 0.1602876 0.124961 0.1211521 -0.433707 -0.2599459 0.0558602 -0.054664 0.1030769 -0.2573205 -0.0171087 -0.0462069 -0.0256369 -0.0909829 0.1148228 -0.0537723 0.0174571 -0.0872071 0.1692284 0.0058489 0.011034 0.0011406 0.1262705 0.0772433 -0.0161026 0.012476 -0.0389649 0.0606938 -0.0435425 0.0056934 -0.0302671 0.0410951 0.0428787 -0.0207731 0.0058857 0.0176732 0.0014457 -0.0272971 0.0259951 -0.0322589 0.0983677 0.088585 0.0042793 -0.0165264 -0.0248704 0.1598243 -0.0006386 -0.0019565 0.0111216 0.1299065 -1.6417144 0.9338388 -0.1313152 0.8632592 -1.7323205 0.0935733 0.002445 -0.0573 -0.618524 2.4762652 -0.6318779 -0.0421307 -0.6262407 2.5348175 0.0532621 0.4037278 -0.3957605 1.6884014 -0.9910673 0.177937 0.2324729 0.2543276 -0.7641686 -0.0954007 0.2863028 -0.0745197 -0.701648 -0.8029223 0.0298945 -0.127733 -0.0442448 -0.9266346 -0.1665568 -0.3642084 -0.0702837 -0.8390408 -0.2552213 -0.0077586 0.0693946 0.014286 -0.2735779 0.0223196 0.005653 0.0858095 -0.1174963 0.0308738 -0.0240096 0.0396493 -0.0216446 0.0671491 -0.0265809 0.033704 -0.0288661 0.0692251 0.0597077 -0.0485601 -0.0102205 -0.0369489 0.0425423 -0.0071868 -0.0149569 -0.0129302 0.0165198 0.0640943 -0.0161748 -0.0321289 0.0378746 -0.0000255 0.0383324 -0.0388372 0.0537869 0.0690695 unknown
polarizability: 108.1124468|-14.3387906|94.512925|5.5902436|-2.0117582|76.8848004 unknown
InChI: InChI=1/3C.3N.3O.2S.7H
charge 0 multiplicity 1
18 atoms
C  -1.70338738 0.35129043 -0.74006604
S  0.45200187 0.01279403 0.13372396
N  -0.49529766 0.67381985 -1.08488961
N  -0.73650102 -0.33912483 1.2109451
O  -1.93917694 -0.24926563 0.40347027
C  1.4592104 1.31093519 0.85612948
H  2.06137926 0.81047908 1.62749499
H  2.10494035 1.67894074 0.04829659
H  0.78722505 2.07914665 1.25301505
H  -2.58077346 0.54654693 -1.36369623
N  1.36307234 -1.05302044 -0.55951725
S  2.41534465 -1.98655705 0.36013142
O  3.42173349 -2.51868247 -0.54599335
O  2.82788227 -1.24517087 1.56717426
C  1.34756213 -3.32360302 0.89911526
H  0.51729066 -2.88541491 1.46890539
H  0.98981073 -3.85272086 0.00759564
H  1.96177679 -3.98144029 1.52865755
