program: Orca
programVersion: 6.1.1
elementType: C C C C C C C C C C Li N C C C N C C C N C C C H H H H H H H H H H H H H H H H H H H H H H H H H H H H H H H H H H H H H H C C C C C C C C C C H H H H H H H H H H H H H H H H
charge: 0
multiplicity: 1
keywords: Opt Freq wB97X-D3 def2-TZVP
frequency: 0.00 0.00 0.00 0.00 0.00 0.00 10.21 19.58 22.90 31.17 39.04 50.55 55.24 60.82 64.90 70.27 76.57 82.93 86.98 89.86 94.68 102.02 110.41 111.14 117.52 128.75 135.82 161.75 171.50 174.90 185.79 190.22 205.58 206.98 209.44 217.88 237.29 239.02 242.13 253.90 258.37 260.71 268.36 277.97 282.99 286.25 293.12 303.67 306.88 314.94 322.32 332.54 343.09 347.77 349.61 366.08 379.05 391.53 394.18 402.56 403.26 409.83 410.69 437.00 441.88 446.47 449.06 459.80 471.28 473.42 478.15 481.91 504.58 527.39 579.58 584.51 608.74 625.12 625.69 661.44 677.41 745.74 763.20 769.01 776.18 781.40 807.06 808.45 825.41 840.71 864.31 876.67 909.54 922.33 925.60 934.36 944.40 959.34 967.49 971.50 973.83 978.86 980.93 1007.01 1016.50 1019.32 1021.01 1031.26 1032.13 1034.08 1054.34 1058.73 1059.11 1062.31 1063.67 1065.31 1067.20 1070.04 1071.75 1091.28 1094.24 1095.25 1105.02 1108.18 1126.88 1128.02 1153.25 1159.76 1182.69 1183.58 1186.68 1188.38 1195.26 1205.59 1207.67 1220.16 1256.15 1260.25 1263.46 1275.68 1283.91 1292.55 1293.84 1301.78 1306.43 1309.84 1312.76 1316.30 1323.75 1331.00 1336.87 1343.96 1361.57 1383.59 1394.43 1397.52 1403.11 1406.31 1410.98 1412.21 1416.70 1416.96 1419.44 1429.31 1434.94 1439.70 1448.75 1449.67 1452.20 1459.22 1465.65 1466.20 1471.07 1472.24 1472.61 1475.56 1480.03 1481.08 1482.63 1486.93 1488.43 1489.46 1490.26 1491.53 1493.77 1495.42 1496.99 1499.43 1499.84 1500.58 1502.49 1505.13 1507.23 1508.87 1510.60 1511.76 1517.55 1518.58 1520.49 1522.43 1527.06 1554.48 1579.30 1647.21 1711.26 1713.46 1730.32 2950.35 2994.80 2994.98 2998.88 3002.66 3003.13 3005.64 3007.61 3009.38 3009.87 3011.21 3014.27 3020.78 3023.69 3039.38 3047.84 3048.51 3051.64 3054.16 3055.15 3068.79 3088.28 3096.76 3098.91 3099.71 3099.86 3103.73 3105.66 3108.77 3111.12 3114.16 3115.22 3118.59 3118.64 3119.44 3120.71 3121.84 3127.60 3137.34 3137.38 3138.08 3138.47 3138.90 3142.92 3148.73 3152.70 3154.98 3155.84 3158.37 3165.00 3168.04 3174.23 3178.20 3234.48
frequency: 10.21 19.58 22.90 31.17 39.04 50.55 55.24 60.82 64.90 70.27 76.57 82.93 86.98 89.86 94.68 102.02 110.41 111.14 117.52 128.75 135.82 161.75 171.50 174.90 185.79 190.22 205.58 206.98 209.44 217.88 237.29 239.02 242.13 253.90 258.37 260.71 268.36 277.97 282.99 286.25 293.12 303.67 306.88 314.94 322.32 332.54 343.09 347.77 349.61 366.08 379.05 391.53 394.18 402.56 403.26 409.83 410.69 437.00 441.88 446.47 449.06 459.80 471.28 473.42 478.15 481.91 504.58 527.39 579.58 584.51 608.74 625.12 625.69 661.44 677.41 745.74 763.20 769.01 776.18 781.40 807.06 808.45 825.41 840.71 864.31 876.67 909.54 922.33 925.60 934.36 944.40 959.34 967.49 971.50 973.83 978.86 980.93 1007.01 1016.50 1019.32 1021.01 1031.26 1032.13 1034.08 1054.34 1058.73 1059.11 1062.31 1063.67 1065.31 1067.20 1070.04 1071.75 1091.28 1094.24 1095.25 1105.02 1108.18 1126.88 1128.02 1153.25 1159.76 1182.69 1183.58 1186.68 1188.38 1195.26 1205.59 1207.67 1220.16 1256.15 1260.25 1263.46 1275.68 1283.91 1292.55 1293.84 1301.78 1306.43 1309.84 1312.76 1316.30 1323.75 1331.00 1336.87 1343.96 1361.57 1383.59 1394.43 1397.52 1403.11 1406.31 1410.98 1412.21 1416.70 1416.96 1419.44 1429.31 1434.94 1439.70 1448.75 1449.67 1452.20 1459.22 1465.65 1466.20 1471.07 1472.24 1472.61 1475.56 1480.03 1481.08 1482.63 1486.93 1488.43 1489.46 1490.26 1491.53 1493.77 1495.42 1496.99 1499.43 1499.84 1500.58 1502.49 1505.13 1507.23 1508.87 1510.60 1511.76 1517.55 1518.58 1520.49 1522.43 1527.06 1554.48 1579.30 1647.21 1711.26 1713.46 1730.32 2950.35 2994.80 2994.98 2998.88 3002.66 3003.13 3005.64 3007.61 3009.38 3009.87 3011.21 3014.27 3020.78 3023.69 3039.38 3047.84 3048.51 3051.64 3054.16 3055.15 3068.79 3088.28 3096.76 3098.91 3099.71 3099.86 3103.73 3105.66 3108.77 3111.12 3114.16 3115.22 3118.59 3118.64 3119.44 3120.71 3121.84 3127.60 3137.34 3137.38 3138.08 3138.47 3138.90 3142.92 3148.73 3152.70 3154.98 3155.84 3158.37 3165.00 3168.04 3174.23 3178.20 3234.48
formula: C29H54LiN3
InChI: InChI=1/C10H16.C10H15.C9H23N3.Li/c1-9-5-4-7-10(2,3)8-6-9;1-5-10(4)8-6-7-9(2)3;1-10(2)6-8-12(5)9-7-11(3)4;/h4-5,7H,6,8H2,1-3H3;5-8H,1H2,2-4H3;6-9H2,1-5H3;/rC10H16.C10H15.C9H23LiN3/c1-9-5-4-7-10(2,3)8-6-9;1-5-10(4)8-6-7-9(2)3;1-11(2)6-8-13(5)9-7-12(3,4)10(11)13/h4-5,7H,6,8H2,1-3H3;5-8H,1H2,2-4H3;6-9H2,1-5H3
87 atoms
C  -0.807863 5.102475 10.563998
C  -0.578872 5.962693 9.331544
C  -0.219058 7.406545 9.499713
C  -0.399452 8.208236 8.24109
C  0.233169 8.009173 10.609649
C  0.489623 7.47129 11.945804
C  0.548972 6.204631 12.370747
C  0.370101 4.955205 11.544738
C  0.072731 3.775976 12.474478
C  1.667433 4.677428 10.782417
Li 3.364897 6.525084 11.318209
N  4.581285 5.543564 12.788393
C  3.766322 5.345027 13.983952
C  5.636294 6.52953 13.028542
C  5.104753 7.948747 13.165183
N  4.304988 8.358956 12.008327
C  3.430085 9.474299 12.349926
C  5.144325 8.698575 10.851097
C  4.4402 8.428181 9.531729
N  4.052065 7.026754 9.384562
C  5.201743 6.151565 9.155349
C  3.121888 6.880297 8.264829
C  5.173188 4.264524 12.384398
H  -1.06687 4.102217 10.205329
H  -1.675185 5.470627 11.12013
H  -1.490975 5.924961 8.726091
H  0.420742 9.077547 10.528114
H  0.643661 8.23718 12.701034
H  0.732661 6.051958 13.431982
H  -1.460815 8.288446 7.990864
H  0.081547 7.706524 7.396095
H  0.008115 9.215636 8.330644
H  1.926618 5.521016 10.137865
H  1.591038 3.821064 10.10918
H  2.489898 4.461259 11.470562
H  0.855992 3.654668 13.227727
H  0.016864 2.846874 11.904638
H  -0.876192 3.915911 12.998121
H  2.807798 5.840891 8.163424
H  3.582498 7.191298 7.316898
H  2.238483 7.492322 8.441681
H  5.709468 6.389401 8.209856
H  4.865159 5.116016 9.120464
H  5.932349 6.2334 9.959824
H  3.529274 9.030025 9.471687
H  5.089629 8.750908 8.703367
H  6.063133 8.11446 10.896668
H  5.450566 9.753128 10.892208
H  4.470598 8.020218 14.050593
H  5.948047 8.633939 13.335599
H  6.336889 6.468659 12.193194
H  6.213915 6.278936 13.931626
H  4.390002 3.542754 12.152818
H  5.808657 3.848694 13.178241
H  5.772139 4.378917 11.480773
H  3.234223 6.257915 14.2544
H  4.376478 5.027985 14.841976
H  3.02272 4.571779 13.792182
H  2.807276 9.740136 11.495458
H  2.768118 9.189701 13.167343
H  3.999126 10.364847 12.653279
C  8.34818 3.097454 9.451515
C  6.998959 2.553791 9.825501
C  6.979862 1.688322 11.052115
C  5.909118 2.795272 9.067824
C  4.547253 2.373768 9.236035
C  3.541199 2.777936 8.378739
C  2.197444 2.408028 8.382031
C  1.240653 3.01303 7.512728
C  1.354168 4.022983 6.611395
C  1.745237 1.34986 9.349922
H  5.968121 1.415137 11.352356
H  7.534777 0.756299 10.891919
H  7.461618 2.188169 11.9023
H  8.29648 3.709381 8.548565
H  8.775753 3.715368 10.253034
H  9.07522 2.296724 9.266732
H  6.080641 3.410893 8.182353
H  4.310475 1.672283 10.029839
H  3.844801 3.476976 7.596109
H  0.679054 1.137656 9.235901
H  2.286513 0.405154 9.213435
H  1.909591 1.632552 10.403615
H  0.235572 2.596435 7.608429
H  0.50668 4.30797 6.000942
H  2.301648 4.49463 6.372908
H  0.178132 5.5018 8.679773
totalener: -1309.37499509250665 hartree
nucrepener: 3834.14111993900133 hartree
electener: -5143.51608275735816 hartree
oneelecener: -9399.64383058123167 hartree
twoeener: 4256.12774782387351 hartree
kineticenergy: 1302.90916642263301 hartree
xcener: -136.022545179227 hartree
dispersion: -0.063735016 hartree
dispersion: -0.063923409 hartree
dispersion: -0.064002618 hartree
dispersion: -0.063950908 hartree
dispersion: -0.063908921 hartree
dispersion: -0.063869893 hartree
dispersion: -0.063794905 hartree
dispersion: -0.063728595 hartree
dispersion: -0.063657847 hartree
dispersion: -0.063651708 hartree
dispersion: -0.063666546 hartree
dispersion: -0.063748879 hartree
dispersion: -0.063816085 hartree
dispersion: -0.063904557 hartree
dispersion: -0.063957152 hartree
dispersion: -0.064021309 hartree
dispersion: -0.064054565 hartree
dispersion: -0.064084962 hartree
dispersion: -0.064091790 hartree
dispersion: -0.064088028 hartree
dispersion: -0.064088861 hartree
dispersion: -0.064097044 hartree
dispersion: -0.064106862 hartree
dispersion: -0.064102254 hartree
dispersion: -0.064091891 hartree
dispersion: -0.064070824 hartree
dispersion: -0.064066896 hartree
dispersion: -0.064053172 hartree
dispersion: -0.064067147 hartree
dispersion: -0.064074193 hartree
dispersion: -0.064093454 hartree
dispersion: -0.064101927 hartree
dispersion: -0.064112026 hartree
dispersion: -0.064105111 hartree
dispersion: -0.064100738 hartree
dispersion: -0.064080024 hartree
dispersion: -0.064074997 hartree
dispersion: -0.064065040 hartree
dispersion: -0.064081024 hartree
dispersion: -0.064088650 hartree
dispersion: -0.064127935 hartree
dispersion: -0.064133185 hartree
dispersion: -0.064159757 hartree
dispersion: -0.064147420 hartree
dispersion: -0.064128974 hartree
dispersion: -0.064090953 hartree
dispersion: -0.064055300 hartree
dispersion: -0.063976645 hartree
dispersion: -0.063935049 hartree
dispersion: -0.063826009 hartree
dispersion: -0.063791364 hartree
dispersion: -0.063769876 hartree
dispersion: -0.063759071 hartree
dispersion: -0.063761567 hartree
dispersion: -0.063770473 hartree
dispersion: -0.063793096 hartree
dispersion: -0.063803739 hartree
dispersion: -0.063817676 hartree
dispersion: -0.063825388 hartree
dispersion: -0.063829628 hartree
dispersion: -0.063828300 hartree
dispersion: -0.063818097 hartree
dispersion: -0.063806070 hartree
dispersion: -0.063789965 hartree
dispersion: -0.063779349 hartree
dispersion: -0.063772542 hartree
energy: -393.8133 -393.6193 -393.3653 -281.4623 -281.3705 -281.3306 -281.2012 -281.1691 -280.9944 -280.4039 -280.3972 -280.3361 -280.3068 -280.2060 -280.1431 -279.9828 -279.7965 -279.6672 -279.5137 -279.4940 -279.3820 -279.3449 -278.5951 -278.5513 -278.2603 -278.2197 -278.1823 -278.0549 -278.0434 -277.3977 -277.2641 -277.2269 -56.2997 -30.0475 -29.4216 -29.0989 -26.6253 -25.4447 -24.9937 -24.4697 -24.4210 -24.3120 -23.7582 -23.1871 -23.0338 -22.8755 -22.5409 -22.2838 -22.0462 -21.9284 -21.7580 -21.3293 -21.0780 -20.7227 -20.5261 -20.2162 -19.7880 -19.7603 -19.1942 -18.5579 -17.6282 -17.5491 -17.2510 -17.2452 -17.1997 -16.9427 -16.6430 -16.3906 -16.3183 -16.2174 -16.0380 -15.8548 -15.7751 -15.6054 -15.3654 -15.2380 -15.1112 -14.7297 -14.6787 -14.5775 -14.4324 -14.3722 -14.2426 -14.1836 -14.0809 -13.9940 -13.9275 -13.8398 -13.7363 -13.6140 -13.5342 -13.4763 -13.3282 -13.2985 -13.2337 -13.1719 -13.0815 -13.0536 -12.8849 -12.8355 -12.7565 -12.6493 -12.5738 -12.4636 -12.3191 -12.2551 -11.9947 -11.8913 -11.6571 -11.5916 -11.4634 -11.2697 -11.2565 -11.0454 -10.8922 -10.5939 -10.5214 -10.3323 -10.0512 -9.9802 -9.9080 -9.7456 -9.0170 -8.5529 -7.1612 -4.2505 0.7805 1.4497 2.2954 2.4287 2.5216 2.7240 2.9737 3.1520 3.2193 3.2494 3.3875 electronvolt
chargesum: 0.0000000
charge: -0.231134 -0.122252 -0.071714 -0.376112 -0.169308 -0.166834 -0.332532 0.440480 -0.392670 -0.467808 0.616205 -0.319883 -0.290216 -0.148956 -0.195971 -0.243618 -0.300840 -0.194675 -0.135104 -0.316928 -0.265889 -0.263845 -0.269774 0.124430 0.113126 0.123177 0.115530 0.123839 0.129661 0.142228 0.152318 0.111125 0.022609 0.093201 0.080643 0.105183 0.154021 0.129256 0.153885 0.137908 0.104196 0.137438 0.128155 0.107316 0.138245 0.131435 0.160201 0.134009 0.157142 0.140315 0.151636 0.135804 0.154537 0.130209 0.134020 0.130755 0.139123 0.142483 0.137074 0.135498 0.140024 -0.336620 -0.032115 -0.341915 -0.190942 -0.232128 -0.173759 0.070996 -0.150396 -0.456687 -0.409501 0.107744 0.121684 0.087766 0.100107 0.081492 0.107349 0.095527 0.098926 0.082218 0.100127 0.124371 0.073884 0.070642 0.092488 0.087425 0.158936
charge: -0.197647 -0.218525 -0.177616 -0.262042 -0.174604 -0.171670 -0.122067 -0.315129 -0.253521 -0.226812 0.382738 0.031830 -0.311441 -0.283903 -0.279526 0.063911 -0.309802 -0.271721 -0.282977 0.034235 -0.304008 -0.310000 -0.303683 0.152169 0.145499 0.156347 0.145559 0.147319 0.149418 0.132335 0.134073 0.122421 0.137473 0.157145 0.134375 0.116271 0.130458 0.125706 0.131343 0.115617 0.123028 0.116986 0.140927 0.113369 0.140596 0.136289 0.141060 0.136984 0.139980 0.137136 0.138914 0.136972 0.124277 0.113737 0.130664 0.118238 0.115980 0.122050 0.121305 0.119042 0.114101 -0.289922 -0.289766 -0.282476 -0.197002 -0.270327 -0.173444 -0.303134 -0.226000 -0.368178 -0.301031 0.120390 0.122146 0.112126 0.118692 0.109238 0.117722 0.143042 0.129160 0.141902 0.115339 0.117418 0.100217 0.139288 0.102914 0.097476 0.163026
qa: -0.2311 -0.1223 -0.0717 -0.3761 -0.1693 -0.1668 -0.3325 0.4405 -0.3927 -0.4678 0.6162 -0.3199 -0.2902 -0.1490 -0.1960 -0.2436 -0.3008 -0.1947 -0.1351 -0.3169 -0.2659 -0.2638 -0.2698 0.1244 0.1131 0.1232 0.1155 0.1238 0.1297 0.1422 0.1523 0.1111 0.0226 0.0932 0.0806 0.1052 0.1540 0.1293 0.1539 0.1379 0.1042 0.1374 0.1282 0.1073 0.1382 0.1314 0.1602 0.1340 0.1571 0.1403 0.1516 0.1358 0.1545 0.1302 0.1340 0.1308 0.1391 0.1425 0.1371 0.1355 0.1400 -0.3366 -0.0321 -0.3419 -0.1909 -0.2321 -0.1738 0.0710 -0.1504 -0.4567 -0.4095 0.1077 0.1217 0.0878 0.1001 0.0815 0.1073 0.0955 0.0989 0.0822 0.1001 0.1244 0.0739 0.0706 0.0925 0.0874 0.1589
va: 3.9220 3.8574 3.8502 3.8856 3.7663 3.9650 3.8898 3.4939 3.8665 3.8672 0.7216 2.7612 3.8578 3.8080 3.8514 2.7136 3.8939 3.8797 3.8455 2.7544 3.8179 3.8201 3.8239 0.9725 0.9694 0.9687 0.9722 0.9678 0.9694 0.9653 0.9628 0.9773 0.9697 1.1606 0.9964 0.9760 0.9754 0.9703 0.9985 0.9748 0.9769 0.9749 1.0423 0.9743 0.9677 0.9839 0.9515 0.9760 0.9510 0.9711 0.9728 0.9829 0.9917 0.9686 0.9774 0.9658 0.9776 0.9810 0.9666 0.9728 0.9695 3.9190 3.6465 3.9157 3.8993 3.7166 3.9786 3.4702 3.9369 3.8052 3.9170 0.9794 0.9641 0.9616 0.9817 0.9592 0.9628 0.9696 0.9710 0.9728 0.9780 0.9607 0.9528 0.9731 0.9832 0.9808 0.9870
dispersion: -0.063772374 hartree
energy: -1309.446017016281 hartree
dipole: 7.273487492 -6.877565086 0.395922406 -2.766973673 7.768038135 5.001064462 2.308664167 1.268167995 3.576832162
dipolemethod: SCF
magnitude: 6.161260311 au
magnitude: 15.660679135 debye
temp: 298.15 k
press: 1.00 atm
zeropoint: 0.78967514 hartree
thermalvibcorrection: 0.03890114 hartree
thermalrotcorrection: 0.00141627 hartree
thermaltrasncorrection: 0.00141627 hartree
thermaltotal: -1308.61460819 hartree
thermalcorr: 0.04173368 hartree
nonthermalcorr: 0.78967514 hartree
totalcorr: 0.83140882 hartree
thermalcorrenthalpy: 0.00094421 hartree
totalenthalpy: -1308.61366398 hartree
vibrat: 0.07010180 hartree
rotat: 0.01742272 hartree
transl: 0.02100680 hartree
total: 0.10853133 hartree
totalentropycorr: -0.10853133 hartree
gibbsenthalpy: -1308.72219531 hartree
gibbsminuselec: 0.72382171 hartree
