program: Orca
programVersion: 6.1.1
elementType: C C C C C C C C C C Li N C C C N C C C N C C C H H H H H H H H H H H H H H H H H H H H H H H H H H H H H H H H H H H H H H N C C C C C H H H H H H C C C C H H H H H H H H H H H H H
charge: 0
multiplicity: 1
keywords: TightOpt Freq wB97X-D3 def2-TZVP
frequency: 0.00 0.00 0.00 0.00 0.00 0.00 2.21 18.92 25.12 27.33 35.14 45.82 46.48 51.74 55.12 66.30 72.02 76.29 80.40 100.62 110.28 122.18 130.98 135.04 140.86 144.64 159.94 169.79 179.95 200.14 210.60 227.87 237.21 243.16 249.55 255.79 260.40 261.93 263.54 271.73 273.91 285.05 286.44 287.89 289.89 294.26 300.70 306.39 307.21 314.02 322.41 324.31 331.90 361.21 363.02 371.85 382.90 398.61 403.30 407.26 409.43 415.71 429.07 431.04 435.31 446.86 454.26 455.57 462.12 464.29 467.65 488.16 499.39 554.46 581.69 589.39 604.61 638.50 643.01 676.35 681.97 687.55 701.55 728.97 740.22 781.49 785.40 807.96 824.60 827.38 863.34 874.77 887.95 921.53 922.90 925.39 934.55 937.59 939.63 945.30 946.69 968.69 971.65 977.13 986.13 992.39 996.89 1005.64 1013.65 1018.74 1021.25 1028.18 1053.67 1054.16 1058.24 1064.07 1068.70 1071.14 1076.63 1077.91 1083.31 1100.49 1105.83 1114.00 1115.57 1119.35 1123.42 1127.43 1155.21 1162.48 1179.64 1184.37 1186.68 1200.32 1203.18 1208.36 1215.67 1222.01 1224.56 1241.68 1248.96 1264.72 1269.92 1280.78 1284.49 1302.20 1304.72 1305.83 1313.32 1318.95 1322.26 1325.98 1334.64 1341.11 1347.13 1352.16 1372.24 1374.22 1386.35 1391.84 1393.45 1398.10 1399.37 1401.80 1407.48 1407.92 1408.37 1416.69 1422.83 1431.66 1440.69 1442.86 1443.83 1448.62 1465.43 1472.41 1473.57 1474.56 1477.39 1477.88 1479.10 1480.25 1481.40 1482.18 1482.76 1485.29 1487.70 1488.07 1488.96 1490.85 1491.77 1493.76 1495.44 1496.47 1497.28 1499.47 1500.91 1502.46 1504.34 1505.82 1506.08 1507.78 1510.70 1511.36 1512.93 1514.47 1517.30 1518.86 1519.57 1524.95 1538.98 1621.29 1669.53 2972.25 2975.60 2981.92 2984.44 2986.03 2987.81 2989.81 2995.58 3000.50 3020.29 3033.97 3037.35 3042.28 3048.30 3048.91 3050.38 3051.23 3054.62 3056.95 3060.23 3064.00 3092.43 3093.46 3093.96 3095.50 3100.24 3103.58 3104.34 3107.00 3109.97 3111.71 3112.67 3116.77 3118.41 3120.38 3120.92 3123.37 3125.73 3127.04 3129.61 3130.37 3131.61 3140.75 3141.53 3144.28 3145.80 3149.14 3150.95 3152.02 3156.56 3157.69 3160.35 3165.68 3168.08 3176.07 3199.79 3558.77
frequency: 2.21 18.92 25.12 27.33 35.14 45.82 46.48 51.74 55.12 66.30 72.02 76.29 80.40 100.62 110.28 122.18 130.98 135.04 140.86 144.64 159.94 169.79 179.95 200.14 210.60 227.87 237.21 243.16 249.55 255.79 260.40 261.93 263.54 271.73 273.91 285.05 286.44 287.89 289.89 294.26 300.70 306.39 307.21 314.02 322.41 324.31 331.90 361.21 363.02 371.85 382.90 398.61 403.30 407.26 409.43 415.71 429.07 431.04 435.31 446.86 454.26 455.57 462.12 464.29 467.65 488.16 499.39 554.46 581.69 589.39 604.61 638.50 643.01 676.35 681.97 687.55 701.55 728.97 740.22 781.49 785.40 807.96 824.60 827.38 863.34 874.77 887.95 921.53 922.90 925.39 934.55 937.59 939.63 945.30 946.69 968.69 971.65 977.13 986.13 992.39 996.89 1005.64 1013.65 1018.74 1021.25 1028.18 1053.67 1054.16 1058.24 1064.07 1068.70 1071.14 1076.63 1077.91 1083.31 1100.49 1105.83 1114.00 1115.57 1119.35 1123.42 1127.43 1155.21 1162.48 1179.64 1184.37 1186.68 1200.32 1203.18 1208.36 1215.67 1222.01 1224.56 1241.68 1248.96 1264.72 1269.92 1280.78 1284.49 1302.20 1304.72 1305.83 1313.32 1318.95 1322.26 1325.98 1334.64 1341.11 1347.13 1352.16 1372.24 1374.22 1386.35 1391.84 1393.45 1398.10 1399.37 1401.80 1407.48 1407.92 1408.37 1416.69 1422.83 1431.66 1440.69 1442.86 1443.83 1448.62 1465.43 1472.41 1473.57 1474.56 1477.39 1477.88 1479.10 1480.25 1481.40 1482.18 1482.76 1485.29 1487.70 1488.07 1488.96 1490.85 1491.77 1493.76 1495.44 1496.47 1497.28 1499.47 1500.91 1502.46 1504.34 1505.82 1506.08 1507.78 1510.70 1511.36 1512.93 1514.47 1517.30 1518.86 1519.57 1524.95 1538.98 1621.29 1669.53 2972.25 2975.60 2981.92 2984.44 2986.03 2987.81 2989.81 2995.58 3000.50 3020.29 3033.97 3037.35 3042.28 3048.30 3048.91 3050.38 3051.23 3054.62 3056.95 3060.23 3064.00 3092.43 3093.46 3093.96 3095.50 3100.24 3103.58 3104.34 3107.00 3109.97 3111.71 3112.67 3116.77 3118.41 3120.38 3120.92 3123.37 3125.73 3127.04 3129.61 3130.37 3131.61 3140.75 3141.53 3144.28 3145.80 3149.14 3150.95 3152.02 3156.56 3157.69 3160.35 3165.68 3168.08 3176.07 3199.79 3558.77
formula: C28H57LiN4
InChI: InChI=1/C10H15.C9H23N3.C9H19N.Li/c1-9-5-4-7-10(2,3)8-6-9;1-10(2)6-8-12(5)9-7-11(3)4;1-8(2)6-5-7-9(3,4)10-8;/h4-7H,8H2,1-3H3;6-9H2,1-5H3;10H,5-7H2,1-4H3;
90 atoms
C  0.560047 7.942489 9.859185
C  0.933482 9.091654 10.749084
C  1.284224 9.022744 12.055435
C  1.315051 10.305032 12.856599
C  1.600722 7.835431 12.797243
C  1.655978 6.510243 12.282075
C  1.720289 6.013687 11.015122
C  1.564562 6.765821 9.71657
C  1.009944 5.7988 8.663857
C  2.905539 7.308865 9.211115
Li 3.800615 7.528358 12.375076
N  5.04562 5.500792 12.426546
C  4.242513 4.42541 12.997015
C  6.178372 5.817814 13.286803
C  5.761791 6.590524 14.528707
N  5.106964 7.853677 14.197978
C  4.255588 8.307376 15.29051
C  6.080872 8.87983 13.829843
C  5.51101 9.922282 12.886783
N  5.041568 9.373816 11.615659
C  6.14585 8.912279 10.784748
C  4.314223 10.417573 10.897486
C  5.486207 5.112281 11.094467
H  0.362088 8.334775 8.853891
H  -0.38544 7.503178 10.195859
H  0.79173 10.083772 10.330704
H  1.520351 7.918048 13.878046
H  1.718071 5.75031 13.061508
H  1.757762 4.930934 10.918521
H  1.183127 11.184844 12.224015
H  2.249068 10.417301 13.418105
H  0.506806 10.30399 13.593159
H  3.326297 8.008916 9.934575
H  2.78512 7.845496 8.263749
H  3.625442 6.502515 9.048468
H  1.674748 4.940208 8.533906
H  0.90131 6.289534 7.692342
H  0.030071 5.4225 8.966296
H  3.922933 10.028251 9.960427
H  4.963378 11.278389 10.674516
H  3.468523 10.754795 11.490887
H  6.858541 9.721885 10.562486
H  5.753249 8.532264 9.8410
H  6.691261 8.103248 11.269674
H  4.66024 10.417808 13.359653
H  6.274213 10.700265 12.717887
H  6.940453 8.398673 13.362147
H  6.469182 9.387066 14.7262
H  5.062184 5.991988 15.113782
H  6.641932 6.748057 15.171095
H  6.88919 6.408828 12.70427
H  6.717127 4.906804 13.595291
H  4.610923 4.912996 10.476074
H  6.117838 4.210309 11.11106
H  6.052843 5.921545 10.63186
H  3.824731 4.719504 13.959052
H  4.840981 3.511841 13.139258
H  3.41226 4.20463 12.330145
H  3.746494 9.230097 15.013838
H  3.484432 7.563801 15.489472
H  4.829842 8.48507 16.21268
N  0.927681 11.365469 7.535346
C  1.924547 11.047445 6.512492
C  1.964737 12.202279 5.505852
C  2.115028 13.560097 6.179598
C  0.990081 13.768715 7.18511
C  0.916277 12.652654 8.233727
H  0.038225 13.791612 6.644659
H  1.094348 14.731621 7.693091
H  2.094208 14.353488 5.428421
H  3.088794 13.635795 6.673579
H  2.773802 12.02896 4.790587
H  1.027371 12.193964 4.940391
C  3.333644 10.761004 7.062543
C  1.430644 9.780378 5.813458
C  2.032033 12.822644 9.282072
C  -0.425406 12.73422 8.963431
H  0.846516 10.603715 8.197359
H  -0.502369 11.958239 9.730127
H  -0.543334 13.702866 9.45482
H  -1.243711 12.592046 8.256859
H  2.061599 11.951484 9.939985
H  3.01888 12.938991 8.835602
H  1.843253 13.704387 9.89915
H  1.38635 8.942939 6.516025
H  0.427989 9.936956 5.414628
H  2.098556 9.496302 4.996927
H  3.276364 10.00946 7.852605
H  3.981116 10.369054 6.274169
H  3.815288 11.645982 7.475457
totalener: -1327.92311701243648 hartree
nucrepener: 3861.86629150929048 hartree
electener: -5189.78944580375719 hartree
oneelecener: -9482.24947464994875 hartree
twoeener: 4292.46002884619156 hartree
kineticenergy: 1321.21863544080088 hartree
xcener: -137.801399136760 hartree
dispersion: -0.062148940 hartree
dispersion: -0.062164668 hartree
dispersion: -0.062186189 hartree
dispersion: -0.062196571 hartree
dispersion: -0.062206331 hartree
dispersion: -0.062210805 hartree
dispersion: -0.062213376 hartree
dispersion: -0.062215123 hartree
dispersion: -0.062217553 hartree
dispersion: -0.062220797 hartree
dispersion: -0.062224595 hartree
dispersion: -0.062227704 hartree
dispersion: -0.062229174 hartree
dispersion: -0.062228377 hartree
dispersion: -0.062226280 hartree
dispersion: -0.062223384 hartree
dispersion: -0.062220378 hartree
dispersion: -0.062218023 hartree
dispersion: -0.062216092 hartree
energy: -393.1767 -393.1280 -393.0583 -391.2795 -280.9490 -280.9425 -280.9083 -280.8236 -280.6087 -280.5459 -280.4248 -280.3243 -280.2025 -280.1689 -280.1161 -279.1469 -279.0882 -279.0384 -279.0174 -278.8890 -278.8338 -278.7945 -278.7177 -278.7102 -278.7026 -278.6387 -278.5637 -278.5003 -278.4420 -277.7841 -277.7497 -277.4760 -55.2847 -29.5647 -29.0822 -28.7572 -27.7869 -25.1350 -24.8599 -24.5853 -24.2972 -24.0188 -23.9695 -22.8838 -22.8543 -22.6784 -22.5948 -22.1061 -21.7396 -21.5626 -21.4120 -21.2875 -21.1689 -21.1281 -20.3504 -20.2968 -19.4330 -19.3273 -19.2512 -18.8273 -18.2518 -18.1991 -17.1841 -16.9166 -16.8277 -16.7935 -16.3337 -16.0924 -15.9998 -15.8975 -15.8053 -15.5802 -15.3812 -15.2548 -15.0507 -15.0007 -14.9551 -14.9010 -14.3790 -14.2986 -14.2600 -14.2397 -14.1577 -13.9819 -13.8846 -13.7850 -13.6647 -13.6557 -13.5445 -13.5368 -13.3861 -13.3134 -13.2182 -13.1499 -13.1049 -12.9708 -12.9328 -12.8211 -12.8171 -12.7254 -12.6802 -12.6686 -12.4902 -12.3300 -12.2580 -12.2174 -12.1866 -12.1398 -11.9711 -11.8103 -11.6639 -11.5392 -11.1744 -10.9428 -10.9341 -10.9168 -10.7862 -10.5365 -10.3000 -10.2027 -10.0205 -9.8592 -9.8188 -9.4881 -9.2910 -7.9817 -7.8082 -5.2548 1.9295 2.7385 2.7942 2.9013 2.9462 3.2401 3.3915 3.4504 3.5792 3.7578 3.8103 electronvolt
chargesum: -0.0000000
charge: -0.218753 -0.230037 0.191165 -0.425272 -0.578734 -0.099967 -0.450584 0.370318 -0.389606 -0.370749 0.591006 -0.253883 -0.313000 -0.133548 -0.185243 -0.237628 -0.300584 -0.182933 -0.149108 -0.250815 -0.283202 -0.286962 -0.278149 0.111841 0.109392 0.003618 0.104101 0.094099 0.106411 0.126765 0.071573 0.136901 0.023359 0.106570 0.108129 0.102995 0.115031 0.125451 0.112676 0.125346 0.154369 0.127866 0.166784 0.094578 0.141006 0.118827 0.142663 0.123692 0.150725 0.124241 0.124737 0.120368 0.148518 0.120388 0.124110 0.130521 0.116461 0.156423 0.139859 0.150112 0.123549 -0.321692 0.149235 -0.200219 -0.204723 -0.212375 0.156875 0.098790 0.099945 0.105307 0.104620 0.098385 0.097278 -0.353713 -0.340302 -0.361869 -0.362555 0.155915 0.142733 0.103098 0.120073 0.069272 0.098458 0.117599 0.099174 0.121871 0.107492 0.076958 0.115590 0.100995
charge: -0.213608 -0.228339 -0.238269 -0.271418 -0.311689 -0.228901 -0.227412 -0.324362 -0.264904 -0.258742 0.387720 0.047090 -0.310410 -0.289192 -0.280473 0.068861 -0.311831 -0.279335 -0.284166 0.045869 -0.315542 -0.312900 -0.315414 0.132969 0.147498 0.119115 0.135929 0.149559 0.130995 0.119439 0.105332 0.127514 0.125789 0.117267 0.117109 0.116678 0.117021 0.124082 0.116208 0.109646 0.126365 0.112099 0.125719 0.107965 0.140437 0.132402 0.136835 0.135140 0.140037 0.132997 0.130985 0.131535 0.123687 0.109220 0.115057 0.116808 0.108373 0.126226 0.121336 0.124591 0.109285 0.095160 -0.384118 -0.217263 -0.258748 -0.217345 -0.382633 0.143020 0.138488 0.134135 0.130638 0.138054 0.143066 -0.268127 -0.264426 -0.267124 -0.264767 0.170165 0.121179 0.120450 0.123225 0.117280 0.112522 0.123002 0.116556 0.123860 0.121092 0.114882 0.122726 0.113171
qa: -0.2188 -0.2300 0.1912 -0.4253 -0.5787 -0.1000 -0.4506 0.3703 -0.3896 -0.3707 0.5910 -0.2539 -0.3130 -0.1335 -0.1852 -0.2376 -0.3006 -0.1829 -0.1491 -0.2508 -0.2832 -0.2870 -0.2781 0.1118 0.1094 0.0036 0.1041 0.0941 0.1064 0.1268 0.0716 0.1369 0.0234 0.1066 0.1081 0.1030 0.1150 0.1255 0.1127 0.1253 0.1544 0.1279 0.1668 0.0946 0.1410 0.1188 0.1427 0.1237 0.1507 0.1242 0.1247 0.1204 0.1485 0.1204 0.1241 0.1305 0.1165 0.1564 0.1399 0.1501 0.1235 -0.3217 0.1492 -0.2002 -0.2047 -0.2124 0.1569 0.0988 0.0999 0.1053 0.1046 0.0984 0.0973 -0.3537 -0.3403 -0.3619 -0.3626 0.1559 0.1427 0.1031 0.1201 0.0693 0.0985 0.1176 0.0992 0.1219 0.1075 0.0770 0.1156 0.1010
va: 3.9205 3.7337 3.5623 3.8962 3.5125 3.9315 3.7584 3.5788 3.8774 3.9398 0.7725 2.7335 3.9009 3.8164 3.8709 2.6936 3.9183 3.8833 3.8556 2.7671 3.8556 3.9154 3.8440 0.9554 0.9736 0.9697 0.9647 0.9636 0.9731 0.9708 0.9581 0.9664 0.9440 0.9909 0.9853 0.9749 0.9705 0.9763 0.9485 0.9717 0.9486 0.9799 0.9607 0.9744 0.9677 0.9854 0.9548 0.9806 0.9572 0.9753 0.9741 0.9859 0.9825 0.9730 0.9707 0.9626 0.9766 0.9783 0.9608 0.9668 0.9676 2.8383 3.9467 3.8874 3.9534 3.9023 3.9466 0.9789 0.9777 0.9743 0.9695 0.9779 0.9805 3.8742 3.8594 3.8975 3.8372 0.9934 0.9773 0.9747 0.9922 1.0009 0.9747 0.9800 0.9960 0.9932 0.9762 1.0029 0.9813 0.9737
dispersion: -0.062214253 hartree
energy: -1327.985281405032 hartree
dipole: 5.151210706 -1.572944297 3.578266409 6.589793263 -6.845919810 -0.256126548 -9.353431347 10.862800848 1.509369502
dipolemethod: SCF
magnitude: 3.892015878 au
magnitude: 9.892718174 debye
temp: 298.15 k
press: 1.00 atm
zeropoint: 0.82792579 hartree
thermalvibcorrection: 0.03829893 hartree
thermalrotcorrection: 0.00141627 hartree
thermaltrasncorrection: 0.00141627 hartree
thermaltotal: -1327.11622414 hartree
thermalcorr: 0.04113147 hartree
nonthermalcorr: 0.82792579 hartree
totalcorr: 0.86905726 hartree
thermalcorrenthalpy: 0.00094421 hartree
totalenthalpy: -1327.11527993 hartree
vibrat: 0.06905399 hartree
rotat: 0.01757913 hartree
transl: 0.02102246 hartree
total: 0.10765558 hartree
totalentropycorr: -0.10765558 hartree
gibbsenthalpy: -1327.22293551 hartree
gibbsminuselec: 0.76234590 hartree
