program: Orca
programVersion: 6.1.1
elementType: Zn S N N S N N Br N N H H C C H C H C H C C C H H H C Br N N H H C C H C H C H C C C H H H C
charge: 0
multiplicity: 1
keywords: WB97X-D4REV def2-tzvp(-f) SMD(dmso) opt freq
frequency: 0.00 0.00 0.00 0.00 0.00 0.00 20.38 22.91 31.29 31.52 46.16 46.76 56.26 65.91 73.35 78.38 80.06 100.11 141.22 142.71 150.27 157.59 159.23 162.94 177.35 179.59 193.45 199.51 209.37 216.77 228.60 292.06 292.67 301.34 302.01 312.86 314.51 317.46 323.03 346.99 347.21 381.17 381.57 451.38 453.84 461.36 464.77 488.69 490.52 493.74 494.21 547.22 548.73 620.79 623.46 648.89 650.68 652.18 653.09 661.12 661.97 698.33 698.88 761.48 762.52 769.85 770.90 835.49 835.66 848.87 849.01 947.63 947.75 1020.58 1020.96 1031.64 1033.77 1045.24 1045.28 1060.95 1060.96 1064.31 1064.34 1138.32 1138.38 1153.91 1154.28 1169.53 1170.02 1198.92 1199.56 1237.36 1237.54 1280.75 1281.46 1334.04 1336.75 1355.72 1357.92 1408.09 1408.15 1461.63 1462.46 1464.80 1465.79 1476.76 1478.24 1480.14 1480.36 1528.04 1528.91 1613.11 1613.50 1642.04 1642.33 1671.94 1672.46 1727.13 1727.29 3074.77 3074.79 3135.15 3135.17 3206.90 3206.90 3230.48 3230.49 3256.25 3256.26 3267.48 3267.51 3592.55 3592.65 3719.95 3719.96
frequency: 20.38 22.91 31.29 31.52 46.16 46.76 56.26 65.91 73.35 78.38 80.06 100.11 141.22 142.71 150.27 157.59 159.23 162.94 177.35 179.59 193.45 199.51 209.37 216.77 228.60 292.06 292.67 301.34 302.01 312.86 314.51 317.46 323.03 346.99 347.21 381.17 381.57 451.38 453.84 461.36 464.77 488.69 490.52 493.74 494.21 547.22 548.73 620.79 623.46 648.89 650.68 652.18 653.09 661.12 661.97 698.33 698.88 761.48 762.52 769.85 770.90 835.49 835.66 848.87 849.01 947.63 947.75 1020.58 1020.96 1031.64 1033.77 1045.24 1045.28 1060.95 1060.96 1064.31 1064.34 1138.32 1138.38 1153.91 1154.28 1169.53 1170.02 1198.92 1199.56 1237.36 1237.54 1280.75 1281.46 1334.04 1336.75 1355.72 1357.92 1408.09 1408.15 1461.63 1462.46 1464.80 1465.79 1476.76 1478.24 1480.14 1480.36 1528.04 1528.91 1613.11 1613.50 1642.04 1642.33 1671.94 1672.46 1727.13 1727.29 3074.77 3074.79 3135.15 3135.17 3206.90 3206.90 3230.48 3230.49 3256.25 3256.26 3267.48 3267.51 3592.55 3592.65 3719.95 3719.96
formula: C16H16Br2N8S2Zn
InChI: InChI=1/2C8H8BrN4S.Zn/c2*1-5(12-13-8(10)14)6-3-2-4-7(9)11-6;/h2*2-4H,10H2,1H3;/q2*-2;+4/rC16H16Br2N8S2Zn/c1-9(11-5-3-7-13(17)21-11)25-23-15(19)27-29(25)26(24-16(20)28-29)10(2)12-6-4-8-14(18)22-12/h3-8H,19-20H2,1-2H3
45 atoms
Zn 6.883323 2.985999 3.864494
S  6.710144 1.557887 5.832542
N  7.990655 4.662106 2.706344
N  8.957758 2.832702 4.403362
S  7.05604 1.55843 1.895969
N  5.776183 4.662217 5.022834
N  4.808756 2.832512 3.326179
Br 5.641534 5.738032 1.709297
N  9.385309 1.907818 5.311592
N  8.836468 0.443363 6.93925
H  8.168071 -0.207356 7.316555
H  9.80487 0.15911 6.921789
C  7.527092 5.569044 1.874437
C  8.314568 6.411367 1.102247
H  7.86885 7.142294 0.441404
C  9.684765 6.27055 1.215421
H  10.347684 6.901445 0.634507
C  10.200676 5.314202 2.078495
H  11.269497 5.18966 2.177353
C  9.326572 4.525266 2.812799
C  9.839723 3.507706 3.766008
C  11.319075 3.364933 3.9424
H  11.541195 2.5784 4.65765
H  11.750129 4.304957 4.299188
H  11.795175 3.125442 2.987805
C  8.421225 1.318548 5.987736
Br 8.1253 5.73882 6.019345
N  4.381039 1.907465 2.418205
N  4.92957 0.44318 0.790283
H  5.598004 -0.207294 0.412622
H  3.96126 0.158646 0.808127
C  6.23974 5.569239 5.854668
C  5.452307 6.411333 6.627153
H  5.898081 7.142304 7.287908
C  4.082108 6.270255 6.514354
H  3.419214 6.900935 7.095528
C  3.566185 5.313898 5.651308
H  2.497366 5.189155 5.552694
C  4.440242 4.525188 4.916702
C  3.926921 3.507589 3.963639
C  2.447533 3.364762 3.787552
H  2.225338 2.578833 3.071664
H  2.016237 4.305047 3.43176
H  1.971735 3.124318 4.742067
C  5.344985 1.318444 1.741642
totalener: -8781.79577185651760 hartree
nucrepener: 5705.65025556376986 hartree
twoeener: 9081.42471778447907 hartree
cpcmener: -0.05341676750851 hartree
kineticenergy: 8770.23295723136835 hartree
exchangeener: -325.825373971639 hartree
dispersion: -0.130637916 hartree
dispersion: -0.130323098 hartree
dispersion: -0.130051341 hartree
dispersion: -0.129684852 hartree
dispersion: -0.129429772 hartree
dispersion: -0.129335238 hartree
dispersion: -0.129254198 hartree
dispersion: -0.129199498 hartree
dispersion: -0.129186219 hartree
dispersion: -0.129175745 hartree
dispersion: -0.129164601 hartree
dispersion: -0.129158368 hartree
dispersion: -0.129159281 hartree
dispersion: -0.129166896 hartree
dispersion: -0.129157473 hartree
dispersion: -0.129126869 hartree
dispersion: -0.129122996 hartree
dispersion: -0.129124282 hartree
dispersion: -0.129132131 hartree
dispersion: -0.129175494 hartree
dispersion: -0.129208885 hartree
dispersion: -0.129243645 hartree
dispersion: -0.129274095 hartree
dispersion: -0.129316233 hartree
dispersion: -0.129336175 hartree
dispersion: -0.129356840 hartree
dispersion: -0.129362059 hartree
elementType: Zn S N Br H C
energy: -13133.9440 -13133.9440 -9444.6373 -2416.5240 -2416.5239 -1701.7244 -1701.7243 -1533.1603 -1533.1603 -1533.0824 -1533.0823 -1533.0788 -1533.0787 -1148.6808 -1011.8570 -1011.8389 -1011.7988 -393.4437 -393.4435 -393.1874 -393.1872 -392.3280 -392.3280 -391.9849 -391.9848 -282.4829 -282.4828 -282.1144 -282.1143 -281.3495 -281.3494 -280.9720 -280.9718 -280.4070 -280.4069 -280.2085 -280.2084 -280.0504 -280.0503 -279.3024 -279.3023 -239.6496 -239.6496 -217.3208 -217.3207 -180.6384 -180.6384 -180.2884 -180.2884 -180.2700 -180.2700 -161.7180 -161.7179 -161.5251 -161.5248 -161.5069 -161.5068 -133.2900 -89.5705 -89.5448 -89.5031 -75.0959 -75.0959 -75.0031 -75.0031 -74.9893 -74.9893 -74.7118 -74.7117 -74.7116 -74.7115 -31.2781 -31.2470 -30.5907 -30.5542 -29.0140 -29.0115 -26.7549 -26.7178 -26.2188 -26.1867 -25.7820 -25.7721 -24.2214 -24.2190 -23.2730 -23.2578 -22.7784 -22.6548 -21.6481 -21.6303 -20.6758 -20.6442 -19.7588 -19.7555 -18.3258 -18.2189 -17.5698 -17.4848 -17.4621 -17.4263 -16.9735 -16.6579 -16.6425 -16.4336 -15.9620 -15.9030 -15.8358 -15.7667 -15.5985 -15.5787 -15.3948 -15.3750 -15.3225 -15.0275 -15.0246 -14.8918 -14.7228 -14.5816 -14.3430 -14.1115 -14.0897 -14.0641 -14.0455 -13.4941 -13.4375 -13.2936 -13.1268 -12.9525 -12.5340 -12.4783 -12.3074 -11.8558 -11.7842 -11.5385 -11.2067 -11.1524 -11.0983 -10.8131 -10.7534 -9.9458 -9.8371 -9.8270 -9.6859 -9.0645 -8.8918 -8.7594 -8.7312 -8.0820 -7.8947 0.0082 0.0324 0.9602 1.0565 2.0383 2.2101 2.5449 2.7002 3.1063 3.2560 3.5294 electronvolt
chargesum: -0.0000000
charge: 0.181058 -0.304807 -0.442913 -0.033914 -0.304800 -0.442924 -0.033878 0.026578 -0.534541 -0.454857 0.245148 0.238809 0.206175 -0.135242 0.157543 -0.127686 0.147693 -0.196670 0.162911 0.405886 0.187529 -0.430703 0.155018 0.158808 0.159393 0.319323 0.026513 -0.534532 -0.454840 0.245152 0.238808 0.206302 -0.135365 0.157509 -0.127571 0.147689 -0.196704 0.162922 0.405923 0.187437 -0.430680 0.155009 0.158791 0.159401 0.319298
charge: -0.468636 0.274754 0.135320 0.106047 0.274739 0.135320 0.106046 0.410746 -0.107356 -0.064983 0.165546 0.168541 -0.389498 -0.128349 0.151823 -0.068397 0.156518 -0.075325 0.158547 -0.109729 -0.161333 -0.233104 0.121700 0.135010 0.134710 -0.546848 0.410716 -0.107359 -0.064974 0.165546 0.168542 -0.389485 -0.128359 0.151820 -0.068396 0.156518 -0.075325 0.158549 -0.109712 -0.161339 -0.233109 0.121698 0.135001 0.134716 -0.546857
qa: 0.1811 -0.3048 -0.4429 -0.0339 -0.3048 -0.4429 -0.0339 0.0266 -0.5345 -0.4549 0.2451 0.2388 0.2062 -0.1352 0.1575 -0.1277 0.1477 -0.1967 0.1629 0.4059 0.1875 -0.4307 0.1550 0.1588 0.1594 0.3193 0.0265 -0.5345 -0.4548 0.2452 0.2388 0.2063 -0.1354 0.1575 -0.1276 0.1477 -0.1967 0.1629 0.4059 0.1874 -0.4307 0.1550 0.1588 0.1594 0.3193
va: 3.0638 1.9388 2.9516 2.9810 1.9388 2.9516 2.9810 1.1986 2.7796 3.0938 0.9585 0.9658 4.1238 3.8401 0.9545 4.0216 0.9636 4.0034 0.9542 3.8677 3.9420 3.8560 0.9978 0.9573 0.9567 4.1598 1.1986 2.7796 3.0938 0.9585 0.9658 4.1236 3.8402 0.9545 4.0214 0.9636 4.0035 0.9542 3.8676 3.9421 3.8560 0.9979 0.9573 0.9567 4.1598
dispersion: -0.129345796 hartree
energy: -8782.176867796496 hartree
dipole: -0.002255222 0.002762415 0.000507193 -32.665048259 36.239265494 3.574217235 0.010228283 -0.009625648 0.000602635
dipolemethod: SCF
magnitude: 3.574217322 au
magnitude: 9.084938441 debye
temp: 298.15 k
press: 1.00 atm
zeropoint: 0.32074430 hartree
thermalvibcorrection: 0.02736205 hartree
thermalrotcorrection: 0.00141627 hartree
thermaltrasncorrection: 0.00141627 hartree
thermaltotal: -8781.82592890 hartree
thermalcorr: 0.03019459 hartree
nonthermalcorr: 0.32074430 hartree
totalcorr: 0.35093889 hartree
thermalcorrenthalpy: 0.00094421 hartree
totalenthalpy: -8781.82498469 hartree
vibrat: 0.04961909 hartree
rotat: 0.01737946 hartree
transl: 0.02143148 hartree
total: 0.08843003 hartree
totalentropycorr: -0.08843003 hartree
gibbsenthalpy: -8781.91341473 hartree
gibbsminuselec: 0.26345307 hartree
