program: Orca
programVersion: 6.1.1
elementType: S N N N N H H N C H C H C H C C C H H H C
charge: -1
multiplicity: 1
keywords: WB97X-D4REV def2-tzvp(-f) opt freq smd(dmso)
frequency: 0.00 0.00 0.00 0.00 0.00 0.00 13.14 48.67 78.76 83.92 105.00 155.82 208.46 285.51 319.43 325.36 352.06 428.11 428.92 442.15 497.59 542.86 552.99 591.27 635.52 690.07 703.39 791.87 797.06 853.48 883.67 986.74 990.46 1020.68 1041.52 1053.37 1058.58 1100.95 1121.06 1144.97 1188.65 1217.81 1304.84 1324.30 1340.37 1397.55 1437.31 1456.37 1473.30 1490.80 1531.49 1574.12 1623.33 1664.17 1705.94 3073.78 3130.11 3197.12 3200.59 3218.41 3229.95 3590.01 3720.91
frequency: 13.14 48.67 78.76 83.92 105.00 155.82 208.46 285.51 319.43 325.36 352.06 428.11 428.92 442.15 497.59 542.86 552.99 591.27 635.52 690.07 703.39 791.87 797.06 853.48 883.67 986.74 990.46 1020.68 1041.52 1053.37 1058.58 1100.95 1121.06 1144.97 1188.65 1217.81 1304.84 1324.30 1340.37 1397.55 1437.31 1456.37 1473.30 1490.80 1531.49 1574.12 1623.33 1664.17 1705.94 3073.78 3130.11 3197.12 3200.59 3218.41 3229.95 3590.01 3720.91
formula: C7H8N5S
InChI: InChI=1/C7H8N5S/c1-5(11-12-7(8)13)6-4-9-2-3-10-6/h2-4H,8H2,1H3
21 atoms
S  2.820128 10.614707 6.34433
N  4.088972 11.09375 -0.870007
N  3.432327 11.410854 2.59914
N  3.272268 10.628705 3.721084
N  3.103035 12.727939 4.76629
H  3.035781 13.162678 3.858538
H  2.716049 13.213116 5.557324
N  3.888351 13.863999 -0.681144
C  4.238293 11.88247 -1.934999
H  4.443036 11.401065 -2.886584
C  4.139924 13.258731 -1.847081
H  4.264792 13.885911 -2.723908
C  3.739545 13.083025 0.37744
H  3.536135 13.560105 1.32887
C  3.838176 11.684458 0.298184
C  3.674439 10.812752 1.49084
C  3.807951 9.330117 1.296395
H  4.791171 9.087029 0.884338
H  3.065285 8.97155 0.578335
H  3.674516 8.811085 2.242012
C  3.075708 11.363297 4.808386
totalener: -943.98841351516774 hartree
nucrepener: 805.14003660157312 hartree
electener: -1749.02887854877008 hartree
oneelecener: -2902.94076831129087 hartree
twoeener: 1153.91188976252079 hartree
cpcmener: -0.10180162375440 hartree
kineticenergy: 941.24215529125422 hartree
exchangeener: -67.697272975387 hartree
dispersion: -0.041926978 hartree
dispersion: -0.041821876 hartree
dispersion: -0.041776188 hartree
dispersion: -0.041776895 hartree
dispersion: -0.041782063 hartree
dispersion: -0.041782116 hartree
dispersion: -0.041781969 hartree
dispersion: -0.041780347 hartree
dispersion: -0.041778275 hartree
dispersion: -0.041776665 hartree
dispersion: -0.041776850 hartree
dispersion: -0.041779116 hartree
dispersion: -0.041781577 hartree
dispersion: -0.041786332 hartree
dispersion: -0.041788097 hartree
dispersion: -0.041787881 hartree
dispersion: -0.041787181 hartree
elementType: S N H C
energy: -2415.4982 -392.6272 -392.5280 -392.4241 -391.8453 -391.3301 -281.4740 -280.8221 -280.5332 -280.5279 -280.4591 -280.3059 -278.9708 -216.2697 -160.6773 -160.4866 -160.4397 -30.6268 -30.3476 -28.4693 -28.1329 -25.8522 -24.4980 -23.1297 -22.0187 -21.2589 -21.0794 -18.7014 -17.6765 -17.3230 -17.1113 -16.7741 -16.0020 -15.2714 -15.1358 -14.9906 -14.3728 -13.7140 -13.5710 -12.9779 -12.1673 -11.9110 -11.7201 -11.5874 -11.5575 -10.0327 -9.6969 -8.7132 -8.5641 -7.7891 -7.2452 0.4791 1.1226 3.0556 3.5056 3.9753 4.3441 4.3761 4.6355 5.0217 5.1704 5.3639 electronvolt
chargesum: -1.0000000
charge: -0.487958 -0.496307 -0.267665 -0.504479 -0.481912 0.231226 0.221647 -0.447002 0.070956 0.136373 0.077781 0.140959 -0.061228 0.163423 0.391775 0.161831 -0.417375 0.135815 0.135903 0.133793 0.162444
charge: -0.188259 0.065089 0.003679 -0.172209 -0.098470 0.154445 0.155420 0.027836 -0.159640 0.139634 -0.167359 0.138695 -0.121713 0.138881 -0.145449 -0.222624 -0.256123 0.124922 0.124955 0.113873 -0.655583
qa: -0.4880 -0.4963 -0.2677 -0.5045 -0.4819 0.2312 0.2216 -0.4470 0.0710 0.1364 0.0778 0.1410 -0.0612 0.1634 0.3918 0.1618 -0.4174 0.1358 0.1359 0.1338 0.1624
va: 1.7007 3.0051 2.8367 2.7179 3.0659 0.9718 0.9841 3.0177 4.0097 0.9743 3.9513 0.9757 4.0787 0.9827 3.7908 3.9990 3.8765 0.9694 0.9692 1.0086 4.5935
dispersion: -0.041787121 hartree
energy: -944.034323864816 hartree
dipole: 1.147487615 -0.422316538 0.725171077 -0.411069791 2.673323773 2.262253982 -7.283929066 1.190022980 -6.093906086
dipolemethod: SCF
magnitude: 6.540593058 au
magnitude: 16.624866355 debye
temp: 298.15 k
press: 1.00 atm
zeropoint: 0.15588282 hartree
thermalvibcorrection: 0.00942364 hartree
thermalrotcorrection: 0.00141627 hartree
thermaltrasncorrection: 0.00141627 hartree
thermaltotal: -943.86618486 hartree
thermalcorr: 0.01225619 hartree
nonthermalcorr: 0.15588282 hartree
totalcorr: 0.16813900 hartree
thermalcorrenthalpy: 0.00094421 hartree
totalenthalpy: -943.86524065 hartree
vibrat: 0.01692092 hartree
rotat: 0.01518596 hartree
transl: 0.01981151 hartree
total: 0.05191839 hartree
totalentropycorr: -0.05191839 hartree
gibbsenthalpy: -943.91715905 hartree
gibbsminuselec: 0.11716482 hartree
