program: Gaussian 09
title: 000004544
version: EM64L-G09RevD.01
frameworkgroup: C1[X(C22H23NO7)]
method: RPBEPBE
basis: SDD
operation: Freq
keyword: #p
keyword: freq=noraman
keyword: PBEPBE/SDD
title: #p freq=noraman PBEPBE/SDD
converged: YES YES NO NO
title: Mulliken charges:
elementType: O O O O O O O N C C C C C C C C C C C C C C C C C C C C C C H H H H H H H H H H H H H H H H H H H H H H H
charge: -0.242488 -0.293270 -0.283640 -0.264193 -0.294573 -0.258206 -0.283771 -0.101344 -0.236430 -0.231261 0.174427 -0.473671 0.429348 -0.559883 0.403542 0.119739 -0.642073 -0.047019 -0.565114 0.021356 0.196206 0.130795 -0.429170 0.098928 -0.330984 0.180463 -0.201303 -0.525410 -0.529585 -0.521874 0.269841 0.262321 0.225760 0.224705 0.234896 0.224855 0.233621 0.222530 0.216848 0.257775 0.281083 0.256701 0.228779 0.239695 0.247749 0.260956 0.224713 0.228827 0.293196 0.217935 0.229631 0.212636 0.265407
chargesum: 0.00000
title: Mulliken charges with hydrogens summed into heavy atoms:
elementType: O O O O O O O N C C C C C C C C C C C C C C C C C C C C C C
charge: -0.242488 -0.293270 -0.283640 -0.264193 -0.294573 -0.258206 -0.283771 -0.101344 0.033411 0.031060 0.174427 -0.023207 0.429348 -0.100132 0.403542 0.119739 0.030927 -0.047019 -0.307339 0.021356 0.196206 0.130795 -0.148087 0.098928 -0.074283 0.180463 0.267171 0.208008 0.210373 0.185800
polarizability: 3.56053957e+02 3.31569595e+00 2.99925316e+02 -3.01513130e+01 -2.36741034e+00 1.71402756e+02
1716.lowfreq: -1.8217 0.0005 0.0006 0.0009 4.2261 5.8953 17.0286 30.3087 34.7795
frequency: 16.9846 30.2973 34.7714 63.7030 66.1416 73.5799 94.3081 98.7246 100.0875 111.4625 127.1734 132.7384 139.9068 147.9425 151.1933 166.6116 173.9728 193.1163 197.3030 206.0678 217.3591 220.2558 237.6897 240.9241 275.2156 285.7443 298.9381 305.9856 313.6209 337.5151 350.2019 369.3042 385.3153 427.3686 441.2224 463.8021 467.4103 499.2197 503.9978 523.3101 526.3615 533.0720 565.0457 583.2995 595.3364 602.7137 628.1908 636.8022 683.6989 691.9424 704.7293 705.7441 735.0061 747.6337 770.8579 772.4495 796.7959 829.5639 837.9445 847.4057 849.2693 862.4191 910.7908 919.7014 921.5098 942.3171 952.0338 959.1120 967.6626 977.9933 1005.5022 1007.0919 1028.5304 1040.4736 1045.4121 1054.9514 1076.2961 1080.7673 1110.0396 1119.0824 1120.5877 1122.2656 1124.0512 1138.8510 1144.0037 1155.1396 1158.3438 1160.0869 1176.6324 1178.6247 1190.9570 1201.4500 1212.7998 1216.5136 1237.2726 1260.1932 1270.0014 1278.6497 1290.9835 1321.3480 1324.7478 1350.2657 1358.3929 1361.8693 1371.6197 1400.7126 1407.3620 1420.3945 1420.9357 1435.3575 1442.4403 1445.4559 1451.3625 1454.9172 1456.6931 1458.4824 1464.0198 1465.1677 1469.6869 1471.4764 1472.1702 1480.8260 1484.5868 1490.1797 1491.1748 1586.8289 1595.8687 1608.8537 1625.2140 1663.0625 2906.3968 2963.9409 2976.4744 2983.7395 2984.6882 2991.9239 2996.7591 3022.5099 3023.7958 3025.1857 3044.5013 3053.9146 3078.5327 3086.0864 3097.2796 3105.1883 3121.7282 3129.9607 3131.3839 3132.8485 3156.1294 3166.5596 3177.4020
redmass: 6.3799 5.2004 4.5673 3.5073 4.3734 2.6899 2.4914 3.9214 2.8093 2.7529 3.4382 2.2944 1.8392 3.4829 1.8725 1.9649 1.9922 3.1807 3.6959 1.2355 3.3269 2.8654 3.7113 5.5377 3.7803 6.6802 4.8538 5.8565 4.2039 4.6749 5.2354 4.9799 4.4970 5.5134 4.5760 3.4110 5.5562 4.0398 5.7975 4.9779 4.9254 5.8045 4.6179 5.4034 4.6566 7.9959 5.4457 5.5243 8.3338 8.4875 5.8582 5.5243 6.5157 5.2305 5.8600 4.8737 3.2767 3.2717 4.3809 1.9743 2.0479 3.3880 7.1530 5.3595 3.6749 5.2995 4.2497 4.8734 1.4277 5.3612 4.7564 3.8845 2.6183 3.8653 2.2175 3.8569 3.9114 1.5309 1.2368 1.9061 1.2489 1.2546 1.4529 1.0944 1.4506 1.4181 1.3815 1.5734 1.3517 2.1810 2.2826 2.5676 1.5535 2.3589 1.7974 2.6036 2.4624 1.8747 2.1669 1.5079 1.4377 1.2924 1.3423 1.3926 4.9913 3.6559 3.1969 1.6170 2.6324 1.2321 1.3952 1.6383 1.0567 1.1374 1.8099 1.3357 1.0645 1.0674 1.1241 1.7931 1.1838 1.1478 1.0580 1.0602 1.0518 7.5081 8.6590 9.2534 9.0844 11.2061 1.0502 1.0638 1.0345 1.0638 1.0316 1.0632 1.0294 1.0855 1.0858 1.0857 1.0868 1.1029 1.1009 1.0974 1.1023 1.1054 1.1060 1.1048 1.1053 1.1041 1.0887 1.0928 1.0968
irintensity: 0.5677 0.7072 0.4067 1.0163 0.7124 3.2992 2.0955 6.5357 4.7170 9.8631 4.2465 0.9172 7.0108 3.4997 3.2970 3.5805 1.8801 1.0745 1.9570 0.8052 1.7297 3.4091 6.6202 3.3725 5.0636 5.2571 5.5517 0.8004 7.6129 1.9027 2.0341 0.7894 2.0792 0.8813 1.8377 1.4349 10.0796 11.1014 9.3596 15.2543 18.1159 0.2721 6.3595 2.4384 9.4237 5.6341 3.4219 22.8509 0.6462 5.1150 14.3635 3.1374 12.5164 1.0405 11.5182 21.8221 4.3983 14.5761 31.4100 24.4361 53.5196 29.2009 17.3759 32.7257 13.2405 47.4076 102.3599 101.2506 8.6873 154.3531 41.7754 48.7629 16.1715 22.1918 48.0097 56.1361 30.1686 13.0608 13.9722 50.3383 5.8457 0.9811 2.7302 7.7311 12.3440 5.5157 8.6346 6.7778 4.0429 40.9757 96.2494 13.9096 15.7113 101.4168 38.9124 111.1246 61.4861 87.2346 35.6517 25.6579 8.8367 6.1337 9.8380 15.7672 70.8334 0.3395 32.1519 37.8858 15.5366 10.9674 14.7347 32.2700 19.9420 37.3344 81.9183 24.5267 16.2855 13.6115 70.3202 127.8823 65.7300 2.9040 12.0570 38.7659 7.2235 18.6951 28.4090 82.2029 31.6962 348.5958 92.8268 37.2410 91.3246 115.4316 84.5937 39.9257 41.8704 17.6709 36.1746 37.0428 8.3723 42.7071 31.1404 35.1141 28.1207 17.5287 30.0745 15.6261 8.8640 17.7978 3.0589 3.7944 4.8505
temp: 298.150 k
press: 1.00000 atm
elementType: 8 8 8 8 8 8 8 7 6 6 6 6 6 6 6 6 6 6 6 6 6 6 6 6 6 6 6 6 6 6 1 1 1 1 1 1 1 1 1 1 1 1 1 1 1 1 1 1 1 1 1 1 1
symmnumber: 1
zpe: 1084784.7 jmol-1
zpe.correction: 0.413173 hartree
zpe.thermalcorrener: 0.441289 hartree
zpe.thermalcorrenthalpy: 0.442233 hartree
zpe.thermalcorrgfe: 0.354445 hartree
zpe.sumelectzpe: -1431.171879 hartree
zpe.sumelectthermal: -1431.143763 hartree
zpe.sumelectthermalent: -1431.142819 hartree
zpe.sumelectthermalfe: -1431.230607 hartree
dipole: 0.3981 1.7310 0.5524
dipole: 1.8601
quadrupole: -168.3418 -156.9130 -170.8361
quadrupole: 3.9472 -4.8971 -2.0661
quadrupole: -2.9782 8.4506 -5.4725 3.9472 -4.8971 -2.0661
hfenergy: -1431.5850519 hartree
pointgroup: C01 [X(C22H23N1O7)]
dipole: 0.1477565 -0.6915055 -0.1885704 debye
polarizability: 353.7177637|-3.252798|299.7304162|36.1576488|-7.6303827|173.9338493 unknown
InChI: InChI=1S/C22H23NO7/c1-23-8-7-11-9-14-20(29-10-28-14)21(27-4)15(11)17(23)18-12-5-6-13(25-2)19(26-3)16(12)22(24)30-18/h5-6,9,17-18H,7-8,10H2,1-4H3
charge 0 multiplicity 1
53 atoms
O  -0.244432 0.583852 1.018626
O  1.197017 1.021548 -1.471272
O  4.028672 2.235932 -1.003534
O  5.704671 1.030276 0.193992
O  -4.542748 1.764205 -0.00348
O  -1.411786 2.571258 0.806873
O  -5.919961 -0.516264 -0.897467
N  0.501758 -2.913972 -0.18206
C  0.554879 -1.432366 -0.301844
C  -0.462037 -0.867401 0.755724
C  1.966664 -0.848246 -0.156178
C  1.289848 -3.411473 0.976591
C  3.00374 -1.577908 0.482429
C  2.787313 -3.025775 0.914277
C  -1.910125 -0.943596 0.317965
C  2.216117 0.452888 -0.705349
C  0.809361 -3.607896 -1.454528
C  -2.482908 0.356832 0.340989
C  4.294682 -1.002141 0.664906
C  3.491444 1.005116 -0.507388
C  4.491559 0.28765 0.180454
C  -1.422305 1.322827 0.733284
C  -2.641491 -2.063403 -0.104508
C  -3.839712 0.560537 -0.040949
C  -3.967402 -1.856712 -0.546904
C  -4.566123 -0.574944 -0.529494
C  5.317729 2.380226 -0.281142
C  1.086459 2.49823 -1.505584
C  -4.387213 2.662458 1.16688
C  -6.309279 0.471595 -1.928472
H  0.165264 -1.154913 -1.296703
H  -0.288532 -1.371105 1.723572
H  1.175826 -4.509804 1.026038
H  0.846937 -3.003322 1.904366
H  3.31087 -3.687804 0.194113
H  3.258226 -3.207241 1.899455
H  0.075342 -3.303404 -2.221528
H  0.715997 -4.698662 -1.304419
H  1.828087 -3.39657 -1.85391
H  5.099158 -1.553929 1.158256
H  -2.175074 -3.051709 -0.112264
H  -4.585597 -2.688878 -0.89831
H  5.170889 3.043148 0.594633
H  6.079703 2.74821 -0.983166
H  2.003446 2.954358 -1.913385
H  0.875718 2.880322 -0.491869
H  0.227438 2.697371 -2.16328
H  -5.22438 3.371517 1.080917
H  -3.416384 3.180201 1.130381
H  -4.479548 2.079863 2.102284
H  -7.391611 0.325519 -2.063767
H  -5.779715 0.259507 -2.87746
H  -6.09175 1.497792 -1.592392
