program: Gaussian 09
title: 000076602
version: EM64L-G09RevD.01
frameworkgroup: C1[X(C7H7NO3)]
method: RPBEPBE
basis: SDD
operation: Freq
keyword: #pfreq=noraman
keyword: PBEPBE/SDD
title: #p freq=noraman PBEPBE/SDD
converged: YES YES NO NO
title: Mulliken charges:
elementType: O O O N C C C C C C C H H H H H H H
charge: -0.404829 -0.513349 -0.372936 -0.626457 -0.037211 0.186742 0.302970 -0.375131 -0.437825 -0.159035 0.243165 0.258695 0.220172 0.231407 0.382822 0.378442 0.389202 0.333156
chargesum: 0.00000
title: Mulliken charges with hydrogens summed into heavy atoms:
elementType: O O O N C C C C C C C
charge: -0.022007 -0.134907 -0.372936 0.095901 -0.037211 0.186742 0.302970 -0.116436 -0.217653 0.072373 0.243165
polarizability: 1.25226187e+02 3.33755028e-01 1.15020304e+02 -1.98437092e-02 2.54481189e-02 3.83552906e+01
1716.lowfreq: -10.2183 -9.5145 -4.9283 -0.0007 -0.0007 0.0004 96.4771 126.4384 225.3691
frequency: 96.4735 126.4383 225.3683 251.1834 304.2650 351.3391 365.1261 389.6802 434.2019 470.6303 515.3770 539.5714 565.8519 589.4325 603.6359 667.3192 677.1073 710.7716 744.1154 778.8625 782.4127 849.0899 962.6578 982.7686 995.1390 1053.9864 1089.1058 1129.3778 1165.2643 1191.6498 1235.8268 1292.0095 1325.0203 1403.2133 1418.4959 1440.7260 1483.2257 1575.4969 1588.4362 1614.8183 1655.8630 2591.2598 3124.1748 3152.4306 3185.1437 3454.1391 3603.2599 3645.8328
redmass: 5.3997 8.9504 4.3805 4.4259 4.6479 1.1774 5.8180 6.3478 7.9875 3.4607 5.3893 5.0371 5.2342 1.8488 2.1861 4.3710 2.7183 1.0871 1.9386 3.6023 5.8664 1.4791 1.3123 4.4172 1.0628 2.9122 2.2987 1.9349 1.1362 1.4203 1.9435 3.1642 2.8716 3.9530 4.2234 2.3424 2.8144 2.0137 3.7139 2.1499 3.6795 1.0741 1.0887 1.0929 1.0966 1.0499 1.0662 1.1011
irintensity: 3.0935 0.0511 0.4092 22.4018 17.7322 109.5727 18.6476 2.3150 5.0446 0.3955 2.1919 11.9433 10.7447 42.8665 70.8942 16.0797 101.7292 111.0478 27.5587 72.4416 5.0602 8.6346 2.1361 119.2176 152.2890 24.8763 5.5746 2.8603 11.2893 35.1024 143.9495 46.7122 54.2550 64.7423 116.4162 147.4171 102.6756 9.6986 412.9667 230.9159 144.1233 540.5492 10.4095 13.2340 5.8351 85.7231 47.1958 95.4442
temp: 298.150 k
press: 1.00000 atm
elementType: 8 8 8 7 6 6 6 6 6 6 6 1 1 1 1 1 1 1
symmnumber: 1
zpe: 349295.1 jmol-1
zpe.correction: 0.133039 hartree
zpe.thermalcorrener: 0.142178 hartree
zpe.thermalcorrenthalpy: 0.143122 hartree
zpe.thermalcorrgfe: 0.099123 hartree
zpe.sumelectzpe: -550.601524 hartree
zpe.sumelectthermal: -550.592386 hartree
zpe.sumelectthermalent: -550.591441 hartree
zpe.sumelectthermalfe: -550.635440 hartree
dipole: -1.5463 5.9162 0.0135
dipole: 6.1150
quadrupole: -54.8124 -58.1600 -67.5813
quadrupole: 3.2386 0.0045 0.0139
quadrupole: 5.3722 2.0246 -7.3967 3.2386 0.0045 0.0139
hfenergy: -550.7345633 hartree
pointgroup: C01[X(C7H7N1O3)]
dipole: -0.5066855 -2.3088091 0.4479569 debye
dipolederiv: -0.7753461 -0.3721088 0.0347575 -0.2756544 -1.0877645 0.1192316 0.0135058 0.1072788 -0.4186603 -0.4463554 0.4762568 -0.1085445 0.3585182 -1.0603262 0.1891194 -0.0812758 0.2056282 -0.4873895 -0.9135691 -0.2504307 -0.0089925 -0.0843622 -0.9819669 0.117845 -0.0461237 0.0967195 -0.4299638 -0.8284083 0.4230589 -0.1151024 0.4694006 -0.8064615 0.0917569 -0.1241494 0.0854607 -0.6914437 -0.8784067 0.03594 -0.1099031 -0.2054863 -0.4609907 0.0606762 -0.056547 0.090638 -0.1010285 0.5905858 0.5789314 -0.0690133 0.207632 0.9551149 -0.1601685 0.0138377 -0.1126295 0.1458847 0.7493191 -0.4801876 0.1900558 0.0628918 0.9358964 -0.1796404 0.0685475 -0.2483545 0.1730467 -0.2815563 -0.477438 0.0992021 -0.0922423 -0.222867 -0.0113667 0.0129313 -0.0609107 -0.2067638 -0.535116 0.4070943 -0.1263638 0.0877085 -0.2550976 0.0090124 -0.0551241 0.0502278 -0.2809395 0.1786151 -0.0103871 0.0379996 -0.0973437 0.4653902 -0.1383169 0.0577551 -0.1273233 -0.0598117 1.7134048 -0.0725582 0.1986454 -0.2048 1.2602782 -0.2455756 0.2282061 -0.2293728 0.346378 0.0527397 0.0404037 -0.0254329 0.0693942 -0.0037196 0.0501143 -0.0320137 0.0462033 0.1658058 0.0536647 -0.0449608 -0.0075387 -0.0762626 -0.1011748 0.0561727 -0.0005944 0.0604103 0.1779337 -0.107702 -0.0091546 -0.0313165 -0.0186229 0.1031997 0.008593 -0.0293226 0.0097111 0.1460438 0.7108411 -0.0726628 0.0602465 -0.103985 0.4479509 -0.0320117 0.0676244 -0.0278321 0.379195 0.1451383 -0.1679019 0.0047495 -0.0964459 0.3401259 -0.0002846 -0.0110772 -0.0105871 0.3966778 0.3496293 0.0474224 -0.0149891 0.0366303 0.2835017 0.0274236 -0.0137356 0.0287443 0.3766948 0.222522 -0.0513172 -0.0084596 -0.0369703 0.1889109 0.0374193 -0.0124445 0.0359881 0.3683406 unknown
polarizability: 123.914452|2.4121865|111.4174054|10.3578148|-16.0545869|43.2699242 unknown
InChI: InChI=1S/C7H7NO3/c8-7(11)6-4(9)2-1-3-5(6)10/h1-3,9-10H,8H2
charge 0 multiplicity 1
18 atoms
O  0.067649 2.547194 -0.369448
O  0.292735 -2.208138 0.72796
O  2.262574 1.499587 0.145039
N  2.502677 -0.733903 0.670896
C  0.248148 0.163461 0.186166
C  -0.527831 1.32928 -0.172968
C  -0.458962 -1.060926 0.372728
C  -1.936081 1.239297 -0.333544
C  -1.853786 -1.15249 0.214376
C  -2.582766 0.009983 -0.140335
C  1.718126 0.333854 0.334333
H  -2.482769 2.145053 -0.60683
H  -2.370499 -2.108398 0.363398
H  -3.668727 -0.056708 -0.265066
H  1.095672 2.406778 -0.207861
H  -0.293672 -2.996688 0.826252
H  2.075837 -1.652141 0.822928
H  3.504874 -0.574295 0.763776
