program: Orca
programVersion: 6.0.1
elementType: P C C C C C C C C C C C C H C H C H C H C H C C C H C C C C C C C H C C C C H C H C H C H C H C C C H H O O H C H O O O O O O C C C C C H H H C C C C H H H C C C H H H Au Au P H H H C C C C C C H H H H H H C C C C C C H H H C C C H H N H S C O O C H H H H H H O C O C C C C H H H H C C H H H H H H H H H H H H C C C C C H H H H H H H H H H H H H H H H H H H H H H H H H H H H H H H H H H H
elementType: Au
charge: 2
multiplicity: 1
keywords: B97-3C PAL16(4x4) Opt CPCM(acetonitrile)
keywords: Freq
formula: C79H97Au2NO12P2S
InChI: InChI=1/C62H76O8P2.C17H21NO4S.2Au/c1-35-25-39(26-36(2)53(35)63-17)71(42-31-45(61(11,12)13)56(66-20)46(32-42)62(14,15)16)49-23-21-47-57(69-33-67-47)51(49)52-50(24-22-48-58(52)70-34-68-48)72(40-27-37(3)54(64-18)43(29-40)59(5,6)7)41-28-38(4)55(65-19)44(30-41)60(8,9)10;1-18(23(3,20)21)11-7-10-17(16(19)22-2)12-15(13-17)14-8-5-4-6-9-14;;/h21-32H,33-34H2,1-20H3;4-6,8-9,11H,10,12-13H2,1-3H3;;/q;-1;;+1/rC79H97Au2NO12P2S/c1-47-33-54(34-48(2)68(47)85-18)96(57-39-60(77(11,12)13)71(88-21)61(40-57)78(14,15)16)65-32-30-63-73(93-46-91-63)67(65)66-64(31-29-62-72(66)92-45-90-62)95(55-35-49(3)69(86-19)58(37-55)75(5,6)7,56-36-50(4)70(87-20)59(38-56)76(8,9)10)80-53(44-82(17)97(23,83)84)43-79(74(89-22)94-81(80)96)41-52(42-79)51-27-25-24-26-28-51/h24-40,44H,41-43,45-46H2,1-23H3
194 atoms
P  3.711939 0.558809 1.163647
C  2.706403 1.095203 -0.271275
C  5.093804 -0.428789 0.48421
C  4.50864 2.067073 1.766692
C  1.794699 2.168563 -0.111686
C  2.842413 0.473919 -1.504379
C  4.82174 -1.667575 -0.092745
C  6.412336 -0.05341 0.668877
C  5.181957 2.86543 0.856898
C  4.524258 2.394108 3.116029
C  1.548174 2.855257 1.16962
C  1.147978 2.591216 -1.249561
C  2.109593 0.870697 -2.625365
H  3.549302 -0.329324 -1.625249
C  5.822411 -2.499565 -0.57889
H  3.795042 -1.987955 -0.153091
C  7.456302 -0.86755 0.247148
H  6.654487 0.86859 1.174577
C  5.952696 3.932317 1.284664
H  5.121637 2.65473 -0.202829
C  5.25023 3.482328 3.597643
H  3.947869 1.785295 3.793939
C  0.725884 2.325999 2.193865
C  2.060327 4.107981 1.398204
C  1.275526 1.945547 -2.469912
H  2.220637 0.366222 -3.573368
C  7.153057 -2.063102 -0.413142
C  6.027382 4.190561 2.660372
C  0.546949 3.012136 3.38703
C  1.864292 4.793339 2.587614
C  -1.436922 0.654599 3.20857
C  -1.481907 1.678963 0.519789
C  1.134456 4.257012 3.615893
H  -0.094269 2.602841 4.150218
C  -0.905412 0.255642 4.422507
C  -2.809497 0.795807 3.078256
C  -2.030035 2.93573 0.745927
C  -1.808479 0.979186 -0.630192
H  0.986812 4.784756 4.545544
C  -1.703727 0.117233 5.559671
H  0.156954 0.077042 4.49114
C  -3.660687 0.684489 4.164933
H  -3.21556 1.023689 2.110719
C  -2.932279 3.488123 -0.147866
H  -1.759285 3.494983 1.631406
C  -2.698463 1.503482 -1.559682
H  -1.349315 0.017897 -0.82329
C  -3.066448 0.452425 5.424364
C  -3.265478 2.751021 -1.289617
C  -0.042573 3.721813 -2.760503
H  -1.119333 3.772943 -2.884276
H  0.460259 4.591598 -3.184686
O  0.274391 3.62712 -1.363022
O  0.456871 2.529063 -3.38955
H  2.832343 6.924931 0.707752
C  3.158656 6.051318 1.265536
H  4.232239 6.05629 1.4425
O  2.472868 6.005811 2.529778
O  2.798555 4.863644 0.542776
O  8.173903 -2.885609 -0.830873
O  6.832629 5.215862 3.101449
O  -4.119749 3.325229 -2.205192
O  -3.877285 0.548167 6.532243
C  8.242633 4.990372 2.967654
C  5.198472 3.875796 5.076147
C  6.642315 4.791145 0.272121
C  8.862654 -0.460575 0.557911
C  9.002024 -2.386352 -1.890219
H  9.507206 -3.249714 -2.313021
H  8.396484 -1.910062 -2.659905
H  9.746519 -1.68142 -1.529609
C  5.469947 -3.841036 -1.223669
C  -3.508877 4.84698 0.081456
C  -3.010754 0.756774 -2.815985
C  -5.484771 2.902859 -2.080207
H  -5.87496 3.141708 -1.09056
H  -6.046187 3.447755 -2.832481
H  -5.587375 1.832782 -2.256417
C  -1.011309 -0.369389 6.845335
C  -5.175274 0.795941 3.948271
C  -3.731087 1.783222 7.243627
H  -4.512185 1.798294 7.997424
H  -2.761279 1.855405 7.729487
H  -3.851622 2.634123 6.57563
Au 2.861938 -1.025218 2.640235
Au 0.455253 -0.98745 1.046577
P  -0.38428 0.957795 1.762929
H  8.729031 5.760403 3.558519
H  8.511865 4.009446 3.357527
H  8.574277 5.068905 1.935309
C  -5.77266 2.024848 4.644124
C  -5.522515 0.91494 2.461328
C  -5.858446 -0.474804 4.46859
C  -0.119421 0.754145 7.393363
C  -1.9447 -0.871711 7.949986
C  -0.111311 -1.566053 6.503327
H  -3.247871 5.524518 -0.73091
H  -4.596292 4.820508 0.12975
H  -3.13841 5.269901 1.011271
H  -3.954529 0.216558 -2.735566
H  -3.100579 1.431218 -3.664164
H  -2.234921 0.026335 -3.029719
C  6.045588 -3.941527 -2.6426
C  6.008014 -4.982587 -0.350292
C  3.959577 -4.031253 -1.348968
C  4.787614 5.346914 5.227532
C  4.171328 3.049608 5.845952
C  6.56211 3.641514 5.738861
H  6.759173 5.812571 0.624175
H  7.634949 4.412547 0.027159
H  6.069457 4.809133 -0.652143
C  2.615067 -2.818677 3.617663
C  2.848113 -3.191997 4.897119
C  2.326503 -3.964004 2.688899
H  2.663829 -4.91505 3.106266
H  2.871594 -3.827671 1.759613
N  3.16057 -2.485855 6.053258
H  2.790473 -4.251298 5.130974
S  3.76445 -0.879515 6.041948
C  3.470796 -3.269292 7.253877
O  4.069368 -0.549366 7.447356
O  2.802664 -0.029624 5.317308
C  5.310044 -0.984134 5.132821
H  5.698202 0.026097 5.060462
H  5.101248 -1.384767 4.14627
H  5.97421 -1.62663 5.700435
H  3.276866 -2.678348 8.138421
H  4.506673 -3.60759 7.261528
H  2.811545 -4.130301 7.266282
O  0.647012 -3.007855 0.247189
C  0.603516 -4.059806 0.90366
O  0.466623 -5.221151 0.309189
C  0.801039 -4.141393 2.381216
C  -0.890893 -4.412422 3.615446
C  0.122523 -5.349267 3.086346
C  -0.15121 -3.231967 3.200937
H  0.756252 -5.748058 3.883932
H  -0.231032 -6.18611 2.488942
H  -0.684726 -2.392346 2.753553
H  0.454667 -2.807476 4.026398
C  -2.113564 -4.598976 4.257328
C  0.322216 -5.228032 -1.136987
H  0.221418 -6.271796 -1.402448
H  1.202466 -4.794287 -1.596872
H  -0.564411 -4.668755 -1.416647
H  4.743429 5.602294 6.286278
H  5.488466 6.018711 4.746171
H  3.801387 5.516467 4.801708
H  6.484716 3.8284 6.809936
H  6.885778 2.610389 5.599837
H  7.327418 4.29893 5.342186
H  4.120929 3.414704 6.870172
H  3.174997 3.125426 5.415255
H  4.44049 1.999863 5.891071
C  -2.885321 -3.486857 4.669672
C  -4.036416 -3.685058 5.393508
C  -4.456234 -4.980869 5.692355
C  -3.721733 -6.089028 5.27214
C  -2.558437 -5.906819 4.562217
H  -2.559193 -2.485866 4.427875
H  -4.616991 -2.840547 5.729603
H  -5.36629 -5.128104 6.257318
H  -4.063827 -7.085653 5.509924
H  -1.973504 -6.757331 4.243395
H  9.492431 -1.323122 0.761299
H  9.319478 0.090972 -0.264004
H  8.879634 0.190584 1.428412
H  5.751183 -5.944042 -0.795391
H  7.087208 -4.93335 -0.246749
H  5.563735 -4.943159 0.644116
H  5.676258 -4.849003 -3.119299
H  5.730476 -3.092858 -3.248985
H  7.127062 -3.983105 -2.645819
H  3.762739 -4.989807 -1.824923
H  3.465381 -4.045818 -0.38131
H  3.497123 -3.256322 -1.958816
H  0.405681 0.408944 8.283828
H  0.626324 1.054049 6.661304
H  -0.697994 1.634464 7.665105
H  0.413758 -1.8899 7.399696
H  -0.701706 -2.40553 6.144154
H  0.644912 -1.331683 5.765456
H  -1.332977 -1.346185 8.716667
H  -2.511919 -0.087084 8.433818
H  -2.643575 -1.615689 7.574253
H  -6.934088 -0.406907 4.307435
H  -5.494609 -1.350989 3.933899
H  -5.683188 -0.617959 5.529661
H  -6.809889 2.146757 4.333143
H  -5.763815 1.928036 5.722596
H  -5.233781 2.931194 4.370517
H  -6.605705 0.920783 2.357173
H  -5.148734 1.837727 2.019422
H  -5.142112 0.076105 1.880565
totalener: -5375.57689238454259 hartree
cpcmener: -0.19826055124502 hartree
kineticenergy: 5178.68470793417328 hartree
xcener: -670.444471817835 hartree
dispersion: -0.755459620 hartree
dispersion: -0.761163257 hartree
dispersion: -0.748892380 hartree
dispersion: -0.748272573 hartree
dispersion: -0.749187059 hartree
dispersion: -0.752419847 hartree
dispersion: -0.752656452 hartree
dispersion: -0.749759167 hartree
dispersion: -0.750042565 hartree
dispersion: -0.752483934 hartree
dispersion: -0.745379869 hartree
dispersion: -0.745671448 hartree
dispersion: -0.749630253 hartree
dispersion: -0.748884770 hartree
dispersion: -0.746546544 hartree
dispersion: -0.748176758 hartree
dispersion: -0.748479212 hartree
dispersion: -0.748582705 hartree
dispersion: -0.746974099 hartree
dispersion: -0.747790542 hartree
dispersion: -0.748334039 hartree
dispersion: -0.747563249 hartree
dispersion: -0.747464268 hartree
dispersion: -0.747455297 hartree
dispersion: -0.747771130 hartree
dispersion: -0.747217023 hartree
dispersion: -0.747069231 hartree
dispersion: -0.747205518 hartree
dispersion: -0.746971093 hartree
dispersion: -0.746780607 hartree
dispersion: -0.747145336 hartree
dispersion: -0.746760416 hartree
dispersion: -0.746966962 hartree
dispersion: -0.746863993 hartree
dispersion: -0.746789968 hartree
dispersion: -0.747006635 hartree
dispersion: -0.746617304 hartree
dispersion: -0.746878835 hartree
dispersion: -0.747062349 hartree
dispersion: -0.746729047 hartree
dispersion: -0.746944282 hartree
dispersion: -0.746827619 hartree
dispersion: -0.746943707 hartree
dispersion: -0.746956964 hartree
dispersion: -0.746997231 hartree
dispersion: -0.746951797 hartree
dispersion: -0.747068108 hartree
dispersion: -0.746975274 hartree
dispersion: -0.747051748 hartree
dispersion: -0.746988014 hartree
elementType: P C H O Au N S
chargesum: 2.0000000
charge: 0.078889 -0.134742 -0.334908 -0.192471 -0.248661 -0.096815 -0.100811 0.043094 -0.022803 -0.065535 -0.308668 0.460027 -0.356477 0.214171 -0.038846 0.353389 -0.020376 0.255562 0.011480 0.228493 0.082231 0.184192 -0.140999 0.470342 0.188127 0.218815 0.261387 0.151420 -0.019764 0.270019 -0.355473 -0.447512 -0.348692 0.207629 -0.211603 -0.088457 0.006680 0.097550 0.219357 0.295329 0.225370 0.074210 0.348878 0.062108 0.215705 -0.072236 0.244844 0.129138 0.237854 -0.116787 0.218239 0.189148 -0.261170 -0.244541 0.196716 -0.108404 0.216226 -0.250666 -0.260329 -0.273148 -0.275154 -0.266202 -0.227954 -0.410798 0.017798 -0.755701 -0.779485 -0.411482 0.199425 0.197186 0.207601 0.119730 -0.695535 -0.709391 -0.357349 0.178876 0.198927 0.178937 -0.184870 0.097361 -0.394269 0.203412 0.171754 0.198566 -0.121061 0.265084 0.254974 0.200975 0.194489 0.203977 -0.636152 -0.568823 -0.645136 -0.543188 -0.431469 -0.577596 0.194775 0.190914 0.200785 0.202781 0.200446 0.198434 -0.606817 -0.604364 -0.602051 -0.572223 -0.480967 -0.612174 0.217922 0.219107 0.199196 -0.391490 -0.089596 -0.536020 0.238209 0.220528 -0.101070 0.201929 0.859914 -0.413151 -0.517650 -0.455661 -0.445049 0.216140 0.205360 0.230912 0.212751 0.204429 0.211951 -0.511462 0.260735 -0.153955 0.497391 -0.184576 -0.394327 -0.298887 0.234157 0.257291 0.228887 0.223395 0.175252 -0.411345 0.219881 0.217680 0.210867 0.176639 0.177518 0.159197 0.182684 0.175866 0.198950 0.196825 0.164004 0.153309 -0.068935 -0.184961 -0.110244 -0.192920 -0.144046 0.233500 0.208446 0.215798 0.217994 0.239894 0.215661 0.218733 0.199265 0.182331 0.184607 0.175074 0.181391 0.177702 0.207857 0.205648 0.146854 0.188599 0.182434 0.177174 0.172212 0.199974 0.161711 0.188801 0.175790 0.180875 0.147121 0.188583 0.181172 0.192247 0.185721 0.211899 0.184796 0.206864 0.188002 0.189016
charge: 1.002370 -0.246702 -0.263735 -0.279815 -0.036843 -0.158363 -0.166407 -0.156265 -0.145339 -0.146058 -0.030222 0.243902 -0.126851 0.191243 -0.004204 0.191710 -0.037366 0.190347 -0.041540 0.186146 -0.003041 0.195062 -0.252603 0.245840 0.230747 0.194178 0.207240 0.206637 -0.154119 0.235339 -0.269978 -0.273081 -0.130912 0.193719 -0.151712 -0.152452 -0.144910 -0.147948 0.195811 -0.007071 0.193496 -0.001560 0.193979 -0.025037 0.187369 -0.031749 0.190543 0.216542 0.194877 0.309611 0.213403 0.203297 -0.606851 -0.581947 0.210816 0.310813 0.208985 -0.582733 -0.595166 -0.834966 -0.838859 -0.802180 -0.852980 -0.052668 -0.133964 -0.400477 -0.399286 -0.055819 0.188618 0.182205 0.176765 -0.136120 -0.388816 -0.395182 -0.044135 0.176716 0.189135 0.176009 -0.133884 -0.135891 -0.057003 0.190415 0.171719 0.181421 -0.079063 0.035120 1.049010 0.189668 0.180515 0.177192 -0.397781 -0.419734 -0.401280 -0.402179 -0.388245 -0.407238 0.177688 0.176174 0.167768 0.175856 0.179864 0.170858 -0.394648 -0.399535 -0.419587 -0.398259 -0.414255 -0.395647 0.179946 0.176543 0.173022 -0.328695 -0.092508 -0.237975 0.177758 0.182176 -0.278245 0.183168 1.747328 -0.301571 -0.861770 -0.884786 -0.492147 0.196089 0.199611 0.194000 0.183496 0.165079 0.176982 -0.530131 0.429359 -0.588488 -0.026893 0.122574 -0.224906 -0.237625 0.215472 0.215328 0.219746 0.237763 -0.078177 -0.025246 0.202101 0.201251 0.202885 0.158249 0.179752 0.166699 0.160236 0.160551 0.173846 0.163102 0.162973 0.161834 -0.085308 -0.145462 -0.079773 -0.143216 -0.080154 0.198568 0.188788 0.190979 0.189953 0.197962 0.178994 0.176007 0.170399 0.160116 0.174559 0.160450 0.159367 0.162226 0.179255 0.164878 0.159995 0.164384 0.162030 0.164346 0.155977 0.164111 0.161546 0.166509 0.156876 0.171850 0.165992 0.160676 0.161452 0.175097 0.160593 0.174848 0.162053 0.164115 0.162270 0.162460
qa: 0.0789 -0.1347 -0.3349 -0.1925 -0.2487 -0.0968 -0.1008 0.0431 -0.0228 -0.0655 -0.3087 0.4600 -0.3565 0.2142 -0.0388 0.3534 -0.0204 0.2556 0.0115 0.2285 0.0822 0.1842 -0.1410 0.4703 0.1881 0.2188 0.2614 0.1514 -0.0198 0.2700 -0.3555 -0.4475 -0.3487 0.2076 -0.2116 -0.0885 0.0067 0.0976 0.2194 0.2953 0.2254 0.0742 0.3489 0.0621 0.2157 -0.0722 0.2448 0.1291 0.2379 -0.1168 0.2182 0.1891 -0.2612 -0.2445 0.1967 -0.1084 0.2162 -0.2507 -0.2603 -0.2731 -0.2752 -0.2662 -0.2280 -0.4108 0.0178 -0.7557 -0.7795 -0.4115 0.1994 0.1972 0.2076 0.1197 -0.6955 -0.7094 -0.3573 0.1789 0.1989 0.1789 -0.1849 0.0974 -0.3943 0.2034 0.1718 0.1986 -0.1211 0.2651 0.2550 0.2010 0.1945 0.2040 -0.6362 -0.5688 -0.6451 -0.5432 -0.4315 -0.5776 0.1948 0.1909 0.2008 0.2028 0.2004 0.1984 -0.6068 -0.6044 -0.6021 -0.5722 -0.4810 -0.6122 0.2179 0.2191 0.1992 -0.3915 -0.0896 -0.5360 0.2382 0.2205 -0.1011 0.2019 0.8599 -0.4132 -0.5177 -0.4557 -0.4450 0.2161 0.2054 0.2309 0.2128 0.2044 0.2120 -0.5115 0.2607 -0.1540 0.4974 -0.1846 -0.3943 -0.2989 0.2342 0.2573 0.2289 0.2234 0.1753 -0.4113 0.2199 0.2177 0.2109 0.1766 0.1775 0.1592 0.1827 0.1759 0.1989 0.1968 0.1640 0.1533 -0.0689 -0.1850 -0.1102 -0.1929 -0.1440 0.2335 0.2084 0.2158 0.2180 0.2399 0.2157 0.2187 0.1993 0.1823 0.1846 0.1751 0.1814 0.1777 0.2079 0.2056 0.1469 0.1886 0.1824 0.1772 0.1722 0.2000 0.1617 0.1888 0.1758 0.1809 0.1471 0.1886 0.1812 0.1922 0.1857 0.2119 0.1848 0.2069 0.1880 0.1890
va: 3.9608 3.2868 3.8446 3.7211 3.6282 3.7827 3.4254 3.7383 3.8395 3.6328 3.6568 3.2832 3.8969 0.9100 3.4162 0.7702 3.3916 0.8653 3.4956 0.9023 3.1204 0.8873 3.6484 3.5005 3.6566 0.9227 3.6021 3.4933 3.6879 3.4617 4.0801 3.9651 3.8958 0.9342 3.7021 3.5298 3.7514 3.6281 0.9275 2.5417 0.8514 3.1221 0.8101 3.5084 0.9018 3.5689 0.8794 3.4842 3.5016 3.6837 0.9181 0.9312 2.1159 2.1172 0.9330 3.6576 0.9114 2.1147 2.0942 1.9840 1.9809 1.9513 1.9975 3.6892 3.8236 3.7436 3.7686 3.6775 0.9446 0.9383 0.9364 3.6392 3.7587 3.7606 3.6955 0.9432 0.9445 0.9443 3.9812 3.6771 3.6725 0.9436 0.9575 0.9457 2.4871 2.0145 4.2920 0.9440 0.9397 0.9374 3.6880 3.8016 3.6609 3.6919 3.7390 3.6382 0.9412 0.9388 0.9387 0.9306 0.9435 0.9426 3.6621 3.6646 3.7947 3.6269 3.8050 3.6749 0.9303 0.9236 0.9441 3.6648 4.0346 3.9707 0.9143 0.8901 2.9387 0.9309 5.1670 3.6959 1.8491 1.7980 3.7386 0.9328 0.9410 0.9325 0.9519 0.9360 0.9335 1.8549 4.2594 2.1604 3.2560 3.8249 3.8666 3.5739 0.9307 0.9257 0.9254 0.9229 3.2758 3.7241 0.9369 0.9387 0.9398 0.9508 0.9813 0.9839 0.9503 0.9514 0.9512 0.9479 0.9708 0.9739 3.6224 4.0024 3.8718 4.0120 3.6785 0.8853 0.9299 0.9279 0.9246 0.9076 0.9274 0.9210 0.9426 0.9490 0.9742 0.9519 0.9488 0.9509 0.9470 0.9447 0.9537 0.9476 0.9546 0.9757 0.9555 0.9539 0.9697 0.9145 0.9498 0.9556 0.9858 0.9478 0.9536 0.9650 0.9487 0.9406 0.9458 0.9408 0.9492 0.9467
dispersion: -0.747019902 hartree
energy: -5376.952364363901 hartree
dipole: -69.800976981 66.498720176 -3.302256805 307.917534292 -314.470865588 -6.553331296 121.940709163 -122.219857318 -0.279148155
dipolemethod: SCF
magnitude: 7.343634984 au
magnitude: 18.666036714 debye
temp: 298.15 k
press: 1.00 atm
zeropoint: 1.58935362 hartree
thermalvibcorrection: 0.10320364 hartree
thermalrotcorrection: 0.00141627 hartree
thermaltrasncorrection: 0.00141627 hartree
thermaltotal: -5375.25697456 hartree
thermalcorr: 0.10603619 hartree
nonthermalcorr: 1.58935362 hartree
totalcorr: 1.69538980 hartree
thermalcorrenthalpy: 0.00094421 hartree
totalenthalpy: -5375.25603035 hartree
vibrat: 0.18841927 hartree
rotat: 0.02015404 hartree
transl: 0.02291725 hartree
total: 0.23149056 hartree
totalentropycorr: -0.23149056 hartree
gibbsenthalpy: -5375.48752091 hartree
gibbsminuselec: 1.46484345 hartree
