program: Orca
programVersion: 5.0.4
elementType: F C C C C C C C O H H H H H
charge: 0
multiplicity: 1
keywords: Opt RIJCOSX PBEh-3c
formula: C7H5FO
InChI: InChI=1/C7H5FO/c8-7(9)6-4-2-1-3-5-6/h1-5H
14 atoms
F  2.776386 1.353864 0.423967
C  2.312501 0.097845 0.319743
C  0.853912 0.052752 0.11735
C  0.25098 -1.197898 -0.005051
C  -1.116007 -1.290726 -0.193585
C  -1.887066 -0.138015 -0.260724
C  -1.289634 1.108166 -0.141051
C  0.078781 1.208033 0.047902
O  3.057656 -0.817127 0.392481
H  0.857776 -2.091634 0.048681
H  -1.582368 -2.261968 -0.287585
H  -2.956655 -0.211934 -0.407015
H  -1.891164 2.005342 -0.195027
H  0.534901 2.183202 0.139813
totalener: -443.91025721 hartree
nucrepener: 405.46865476 hartree
electener: -849.37891197 hartree
oneelecener: -1409.11636366 hartree
twoeener: 559.73745169 hartree
kineticenergy: 440.83769095 hartree
exchangeener: -31.491066412124 hartree
correlationener: -2.838310098404 hartree
xcener: -34.329376510527 hartree
dispersion: -0.007758599 hartree
energy: -683.6569 -530.9697 -288.9239 -285.2909 -285.0929 -285.0488 -285.0357 -284.9062 -284.8962 -37.4382 -32.3036 -26.8569 -24.0109 -23.5221 -20.5107 -19.3141 -18.4518 -17.3302 -15.6727 -15.6035 -15.4491 -14.4943 -14.4103 -13.8217 -12.9559 -12.4818 -11.8601 -11.7140 -11.4998 -10.0992 -8.7640 -8.6639 -1.2373 -0.0674 2.0923 3.4752 4.9946 5.1704 5.3239 5.7641 6.0642 6.6930 7.6232 8.0620 8.3695 8.7995 9.7184 10.8987 12.7958 12.9080 13.9994 14.9005 15.1500 15.3446 15.7399 16.1821 16.3981 16.5900 16.6398 16.8965 17.2050 18.3562 18.4197 18.9559 19.7545 20.0557 20.2462 24.6598 25.1575 25.1954 25.2851 25.9161 26.5494 27.1573 27.4583 28.1541 28.8726 29.2179 29.4805 29.7936 30.8145 31.8205 32.1021 32.6354 33.2435 34.5932 35.1400 35.3083 35.4717 36.6304 37.7516 38.7414 39.1638 39.8864 41.1112 41.4499 41.9312 42.5488 44.2973 47.2908 48.8276 49.4740 50.3969 50.8797 51.1016 52.7277 53.7484 55.6418 56.0092 56.7032 57.6981 57.9576 58.8661 59.3784 59.8114 60.1988 62.1821 63.5657 63.7049 64.1027 67.5420 68.4080 70.8375 71.4762 73.0338 74.1552 74.8058 75.1127 75.5651 77.0912 78.7494 81.6192 82.6185 84.8888 87.9915 94.8695 359.6561 370.5903 371.0532 380.7141 384.3411 385.8591 395.7413 700.1053 893.9564 electronvolt
chargesum: 0.0000000
charge: -0.296785 0.654443 -0.141975 -0.228016 -0.209290 -0.210988 -0.210251 -0.241366 -0.327614 0.259198 0.234697 0.234800 0.234216 0.248930
charge: -0.145506 0.219881 -0.116716 -0.088272 -0.131601 -0.106459 -0.132805 -0.098464 -0.139760 0.157786 0.143213 0.142765 0.142793 0.153146
qa: -0.2968 0.6544 -0.1420 -0.2280 -0.2093 -0.2110 -0.2103 -0.2414 -0.3276 0.2592 0.2347 0.2348 0.2342 0.2489
va: 1.1344 4.1285 3.7283 3.7712 3.7940 3.8060 3.7964 3.7912 2.3031 0.9058 0.9065 0.9063 0.9064 0.9106
dispersion: -0.007758585 hartree
energy: -443.894595078764 hartree
dipole: -9.90294 8.41593 -1.48701 -1.93524 2.10905 0.17380 -1.41752 1.21966 -0.19787
magnitude: 1.51015 au
magnitude: 3.83850 debye
