program: Orca
programVersion: 5.0.4
elementType: F C C C C C C C H H H H H
charge: 2
multiplicity: 1
keywords: Freq RIJCOSX PBEh-3c
frequency: 0.00 0.00 0.00 0.00 0.00 0.00 79.65 107.72 313.64 333.82 430.26 431.47 566.91 588.59 648.90 733.80 775.96 812.52 975.20 999.09 1024.14 1032.40 1058.85 1134.90 1224.59 1259.63 1289.78 1295.15 1410.76 1475.46 1558.95 1600.93 1690.16 2111.11 3268.38 3273.12 3277.68 3294.25 3296.30
frequency: 79.65 107.72 313.64 333.82 430.26 431.47 566.91 588.59 648.90 733.80 775.96 812.52 975.20 999.09 1024.14 1032.40 1058.85 1134.90 1224.59 1259.63 1289.78 1295.15 1410.76 1475.46 1558.95 1600.93 1690.16 2111.11 3268.38 3273.12 3277.68 3294.25 3296.30
formula: C7H5F
InChI: InChI=1/C7H5F/c8-6-7-4-2-1-3-5-7/h1-5H
13 atoms
F  3.542923 -0.261238 -0.251386
C  2.354875 -0.174685 -0.16454
C  1.070873 -0.080549 -0.070728
C  0.252322 -1.308296 -0.143196
C  -1.089803 -1.15902 -0.048823
C  -1.664541 0.124061 0.112161
C  -0.88983 1.305948 0.185224
C  0.460343 1.254066 0.099748
H  0.725672 -2.274799 -0.266514
H  -1.725156 -2.03623 -0.097507
H  -2.745053 0.205152 0.183546
H  -1.376068 2.266869 0.310759
H  1.083542 2.138623 0.151255
totalener: -367.86799333 hartree
nucrepener: 317.09798208 hartree
electener: -684.96597541 hartree
oneelecener: -1104.27257127 hartree
twoeener: 419.30659586 hartree
kineticenergy: 365.37447635 hartree
exchangeener: -26.474588560609 hartree
correlationener: -2.364363742370 hartree
xcener: -28.838952302979 hartree
energy: -699.6349 -303.0814 -298.0858 -296.7395 -296.7364 -296.5204 -295.3043 -295.3041 -53.8116 -38.6881 -36.2038 -34.5223 -33.4496 -31.7762 -30.5060 -30.2041 -29.4913 -28.2793 -26.4280 -25.7717 -24.5618 -24.2896 -23.5359 -22.4351 -22.0251 -20.5616 -19.3860 -14.4661 -14.2723 -10.1355 -9.7297 -8.7935 -5.7352 -5.7154 -4.5141 -4.4728 -3.0618 -2.8451 -2.1028 -2.0337 -1.5656 -0.5680 0.4932 1.0222 1.4458 3.2136 3.8202 3.8319 3.8566 5.3390 5.7593 5.8240 6.4598 6.6640 6.7349 6.9542 7.5488 7.9362 8.3534 9.3676 9.7801 10.9837 14.6407 15.4965 15.6357 15.8864 16.7484 17.1373 17.4000 17.7080 18.6015 18.9133 19.2023 19.6281 20.3042 20.5245 21.2782 21.5810 22.1989 22.5505 23.4442 24.4938 25.0601 25.3658 28.9752 29.3447 30.5177 30.5904 31.0358 31.6269 35.0499 35.5566 35.9821 36.5981 39.3679 42.3482 43.2318 44.2581 44.2983 44.9264 46.0901 46.5685 47.9012 48.7414 49.2737 51.0315 51.3699 53.4702 53.9643 57.5097 60.6648 60.9942 61.8503 62.8238 63.5953 63.6484 65.4678 68.0770 69.0870 74.1852 75.1239 82.1292 348.9860 357.1264 358.5616 365.9772 373.6129 377.7966 383.5032 877.8132 electronvolt
chargesum: 2.0000000
charge: 0.108520 0.791745 -0.168643 -0.100253 -0.182586 -0.076470 -0.182074 -0.101004 0.373398 0.384499 0.394844 0.384329 0.373696
charge: 0.258619 0.615514 -0.065987 0.040804 -0.065714 0.139533 -0.065742 0.040847 0.216873 0.222703 0.222961 0.222681 0.216906
qa: 0.1085 0.7917 -0.1686 -0.1003 -0.1826 -0.0765 -0.1821 -0.1010 0.3734 0.3845 0.3948 0.3843 0.3737
va: 1.6666 3.5010 3.7064 3.6143 3.6867 3.5005 3.6870 3.6142 0.8369 0.8312 0.8221 0.8313 0.8367
dispersion: -0.006935579 hartree
energy: -367.859647590165 hartree
dipole: -9.47866 9.35627 -0.12240 0.70151 -0.69225 0.00926 0.66607 -0.65897 0.00710
magnitude: 0.12295 au
magnitude: 0.31252 debye
temp: 298.15 k
press: 1.00 atm
zeropoint: 0.09881338 hartree
thermalvibcorrection: 0.00384741 hartree
thermalrotcorrection: 0.00141627 hartree
thermaltrasncorrection: 0.00141627 hartree
thermaltotal: -367.75415426 hartree
thermalcorr: 0.00667995 hartree
nonthermalcorr: 0.09881338 hartree
totalcorr: 0.10549333 hartree
thermalcorrenthalpy: 0.00094421 hartree
totalenthalpy: -367.75321005 hartree
vibrat: 0.00637965 hartree
rotat: 0.01331875 hartree
transl: 0.01898175 hartree
total: 0.03868015 hartree
totalentropycorr: -0.03868015 hartree
gibbsenthalpy: -367.79189020 hartree
gibbsminuselec: 0.06775739 hartree
