program: Gaussian 09
title: 000076582
version: EM64L-G09RevD.01
frameworkgroup: C1[X(C10H10O)]
method: RPBEPBE
basis: SDD
operation: Freq
keyword: #pfreq=noraman
keyword: PBEPBE/SDD
title: #p freq=noraman PBEPBE/SDD
converged: YES YES NO NO
title: Mulliken charges:
elementType: O C C C C C C C C C C H H H H H H H H H H
charge: -0.279210 0.414068 0.291386 0.165654 -0.515475 -0.522986 -0.409902 -0.355764 -0.667601 -0.238308 -0.218315 0.226402 0.223350 0.266686 0.242596 0.249939 0.220856 0.219018 0.237317 0.223329 0.226960
chargesum: 0.00000
title: Mulliken charges with hydrogens summed into heavy atoms:
elementType: O C C C C C C C C C C
charge: -0.279210 0.414068 0.291386 0.165654 -0.065723 -0.256300 -0.167305 -0.105826 0.009590 -0.014978 0.008645
polarizability: 1.63478992e+02 2.54263229e+00 1.06784807e+02 -6.69491888e+00 2.75674709e+00 5.60883176e+01
1716.lowfreq: -5.7833 -2.8981 0.0005 0.0005 0.0008 11.2614 54.0214 95.1337 182.8292
frequency: 54.0058 95.1274 182.8277 218.3655 248.0606 280.1612 358.9741 431.9971 454.0406 492.2736 571.4222 602.7840 622.6881 666.4559 748.7828 752.1024 777.6630 796.7948 828.1157 859.6794 862.0512 901.8375 936.3494 960.2409 975.2180 1007.0610 1054.6955 1069.9460 1095.1920 1144.0439 1159.3964 1164.8707 1221.1233 1255.4465 1274.5301 1310.3461 1320.9710 1388.5637 1411.9843 1442.2588 1457.5618 1464.3833 1474.9618 1487.5896 1591.5055 1603.7494 1624.0601 2985.3877 2990.8034 3051.6827 3088.4162 3101.2759 3130.9341 3144.7667 3159.7944 3174.1013 3221.3792
redmass: 2.7360 3.4302 1.7903 1.9758 4.3367 1.9946 4.0631 3.0213 3.7940 4.4211 3.6571 6.6197 5.0125 3.8963 3.7410 1.2430 1.3329 3.6897 1.3351 4.6830 1.4803 7.1513 1.3860 2.1642 1.3029 2.0874 1.8566 1.6358 2.1743 1.4763 1.4865 1.5003 2.0207 2.2537 1.4662 1.7258 1.6173 1.2005 4.2802 3.0552 1.1229 2.6945 1.0448 1.0608 7.0277 7.4033 7.9743 1.0629 1.0356 1.0972 1.1006 1.1009 1.0855 1.0906 1.0961 1.0990 1.0984
irintensity: 0.3865 1.9739 1.3527 1.1913 0.8730 2.0409 1.4697 5.5772 1.5268 0.9287 0.0623 1.3050 2.8038 4.2478 1.5727 85.0222 2.0494 5.3969 44.5298 10.4330 7.7129 12.6183 6.1760 19.7693 0.0187 9.7383 17.9248 3.1076 8.9146 8.5679 18.8059 14.7225 5.5457 14.1409 2.9769 1.1370 16.7209 8.6428 10.0338 31.8828 9.7460 7.3643 12.3395 9.4548 9.8593 24.5708 1.9008 27.3801 39.3520 8.8351 46.4187 33.4327 1.4633 12.7041 26.3789 14.3359 4.4613
temp: 298.150 k
press: 1.00000 atm
elementType: 8 6 6 6 6 6 6 6 6 6 6 1 1 1 1 1 1 1 1 1 1
symmnumber: 1
zpe: 447109.1 jmol-1
zpe.correction: 0.170295 hartree
zpe.thermalcorrener: 0.179510 hartree
zpe.thermalcorrenthalpy: 0.180455 hartree
zpe.thermalcorrgfe: 0.135621 hartree
zpe.sumelectzpe: -461.498206 hartree
zpe.sumelectthermal: -461.488990 hartree
zpe.sumelectthermalent: -461.488046 hartree
zpe.sumelectthermalfe: -461.532879 hartree
dipole: 0.7692 0.8693 0.0867
dipole: 1.1640
quadrupole: -54.8673 -59.3138 -68.9296
quadrupole: 2.2018 -1.2364 0.4817
quadrupole: 6.1696 1.7231 -7.8927 2.2018 -1.2364 0.4817
hfenergy: -461.6685007 hartree
pointgroup: C01 [X(C10H10O1)]
dipole: -0.3085078 0.3370415 0.0308015 debye
dipolederiv: -0.8648778 0.160516 0.0803172 -0.0544476 -0.5579637 -0.0409471 0.0667068 -0.0590028 -0.1494093 0.5475701 -0.0121951 -0.0252464 0.0224434 0.569021 0.0496995 -0.0897709 0.0510839 -0.035266 0.2338928 -0.021485 -0.02869 -0.3350706 -0.1350073 0.0062911 -0.0501663 -0.0170436 0.0463441 0.5056633 -0.0512268 -0.0550833 0.4280746 0.0228806 -0.0396132 0.0031702 -0.0005514 0.0461855 0.0101406 0.0120972 -0.0155134 -0.1183105 0.1068797 -0.0228484 -0.070034 -0.0350211 0.107489 -0.3585306 -0.1525626 -0.0268147 -0.1120311 -0.0664089 0.0250966 -0.0001132 0.0337266 -0.2389722 0.024847 0.0149222 -0.0151897 0.0458654 0.1247828 0.031972 -0.0142088 0.0339241 -0.1686429 0.0067559 -0.0208533 -0.0141393 -0.0500866 0.0560563 0.0257727 -0.0252042 0.0295206 -0.1631227 -0.027319 -0.0104412 -0.024734 0.0372536 0.0513712 -0.0364241 0.0814606 -0.0284115 0.0198653 0.0294664 0.0653105 -0.0158965 0.1558098 -0.0447962 0.003804 -0.0028968 0.0085825 -0.1750715 -0.0984203 -0.013948 -0.0179423 -0.0771837 0.0421831 0.031307 -0.0177024 0.0275046 -0.180566 -0.0401377 -0.0280624 0.0173525 -0.0671695 0.0234058 0.1142394 0.0459938 0.0819586 -0.0696304 0.0107014 0.0248685 0.0040225 0.0850313 -0.1052304 -0.0850053 -0.0076545 -0.0517692 0.0678725 0.069789 0.0465946 0.0182329 0.0810538 -0.0108144 -0.0290257 0.021135 -0.0267997 0.1837002 0.0774431 -0.0070764 0.0078975 -0.04355 -0.0981853 -0.0264 0.0038189 -0.0296641 0.1614714 0.0941675 -0.0395651 0.0040003 -0.0063967 -0.0587981 -0.0254616 0.0081236 -0.0240192 0.1759591 0.1108359 -0.0415098 0.0372078 -0.0114415 -0.0042545 0.1243025 -0.0100208 0.0835306 -0.0825576 -0.2555875 -0.0429154 0.0037309 -0.0574063 0.0974892 -0.013054 0.0004501 -0.0108014 0.0676266 0.099318 0.0944136 0.0168674 0.058767 -0.0854494 -0.062932 0.0045112 -0.0348644 0.064281 -0.1181922 -0.0783802 0.0173785 -0.0798413 0.0574773 -0.0042759 0.0186688 -0.0044911 0.1626106 -0.057526 0.1014986 0.0322421 0.0986365 0.0153613 -0.0264975 0.033733 -0.0273921 0.1598334 unknown
polarizability: 163.5946682|-0.2844599|105.9033672|-6.4600972|6.9747975|56.8540814 unknown
InChI: InChI=1S/C10H10O/c1-2-9-7-8-5-3-4-6-10(8)11-9/h3-7H,2H2,1H3
charge 0 multiplicity 1
21 atoms
O  -0.91966 -0.934552 0.08489
C  -1.63596 0.285244 0.293868
C  0.582149 0.835979 0.136065
C  0.442309 -0.57657 -0.010581
C  -3.121693 0.148745 0.419049
C  -0.76355 1.356646 0.327393
C  1.881104 1.400537 0.073191
C  1.515565 -1.454085 -0.214949
C  -3.793568 -0.429106 -0.855256
C  2.979514 0.537746 -0.132265
C  2.801797 -0.868238 -0.274459
H  -3.358265 -0.507609 1.280087
H  -3.539867 1.145187 0.649771
H  -1.048593 2.39701 0.472292
H  2.031812 2.479898 0.181212
H  1.363336 -2.531798 -0.322048
H  -3.619201 0.227101 -1.726275
H  -4.883803 -0.526016 -0.705299
H  -3.384824 -1.426622 -1.09044
H  3.99174 0.953718 -0.184237
H  3.676158 -1.508714 -0.432807
