program: Orca
programVersion: 5.0.4
elementType: N C N H H H H
charge: 2
multiplicity: 1
keywords: Freq RIJCOSX PBEh-3c
frequency: 0.00 0.00 0.00 0.00 0.00 0.00 444.50 444.99 844.60 929.25 929.44 1101.88 1101.95 1232.23 1565.04 1606.22 2337.12 3211.35 3279.04 3314.33 3314.43
frequency: 444.50 444.99 844.60 929.25 929.44 1101.88 1101.95 1232.23 1565.04 1606.22 2337.12 3211.35 3279.04 3314.33 3314.43
formula: CH4N2
InChI: InChI=1/CH4N2/c2-1-3/h2-3H2
7 atoms
N  1.212517 0.060897 -0.412087
C  -0.000014 0.000095 -0.228898
N  -1.212494 -0.060882 -0.045538
H  1.720655 0.972461 -0.440488
H  1.792555 -0.796383 -0.548628
H  -1.891172 -0.040354 -0.838642
H  -1.622147 -0.135935 0.911782
totalener: -148.82309772 hartree
nucrepener: 73.23030499 hartree
electener: -222.05340271 hartree
oneelecener: -332.49160378 hartree
twoeener: 110.43820108 hartree
kineticenergy: 147.79971734 hartree
exchangeener: -10.718880119643 hartree
correlationener: -0.958661944718 hartree
xcener: -11.677542064362 hartree
energy: -415.3624 -415.3605 -303.8349 -45.3161 -43.6277 -34.2673 -32.7350 -31.5123 -31.5117 -26.4294 -26.4283 -14.6195 -14.6185 -10.2103 -8.4764 -6.8090 -6.8084 -6.1293 -0.0571 0.9410 0.9420 2.6490 4.2851 6.7131 8.3742 8.3769 11.8816 11.8826 11.9439 13.9894 15.0685 15.4202 15.4232 24.1919 25.2133 28.0550 30.4381 31.9954 31.9974 35.5701 38.8879 44.3153 46.2200 46.2224 49.8336 52.5425 60.0564 66.9869 66.9882 72.1975 361.9141 511.2414 511.3676 electronvolt
chargesum: 2.0000000
charge: -0.573861 0.893293 -0.573599 0.563548 0.563560 0.563543 0.563517
charge: -0.041320 0.458140 -0.041266 0.406108 0.406121 0.406121 0.406095
qa: -0.5739 0.8933 -0.5736 0.5635 0.5636 0.5635 0.5635
va: 3.2377 3.6583 3.2378 0.6745 0.6745 0.6745 0.6745
dispersion: -0.001753410 hartree
energy: -148.817450726663 hartree
dipole: -0.00011 -0.00005 -0.00016 -0.00030 0.00017 -0.00012 -0.00053 0.00003 -0.00050
magnitude: 0.00054 au
magnitude: 0.00137 debye
temp: 298.15 k
press: 1.00 atm
zeropoint: 0.05844955 hartree
thermalvibcorrection: 0.00077104 hartree
thermalrotcorrection: 0.00141627 hartree
thermaltrasncorrection: 0.00141627 hartree
thermaltotal: -148.75539760 hartree
thermalcorr: 0.00360358 hartree
nonthermalcorr: 0.05844955 hartree
totalcorr: 0.06205313 hartree
thermalcorrenthalpy: 0.00094421 hartree
totalenthalpy: -148.75445339 hartree
vibrat: 0.00105762 hartree
rotat: 0.00986517 hartree
transl: 0.01771034 hartree
total: 0.02863313 hartree
totalentropycorr: -0.02863313 hartree
gibbsenthalpy: -148.78308652 hartree
gibbsminuselec: 0.03436421 hartree
