program: Orca
programVersion: 5.0.4
elementType: C N C N C H H H H H H H H
charge: 2
multiplicity: 1
keywords: Freq RIJCOSX PBEh-3c
frequency: 0.00 0.00 0.00 0.00 0.00 0.00 144.01 149.23 161.01 240.93 282.79 569.25 598.31 759.24 775.63 818.18 949.82 1138.78 1144.16 1148.56 1165.15 1236.87 1402.56 1428.27 1459.03 1486.78 1489.32 1504.15 1512.07 1548.80 2309.53 3132.45 3133.60 3252.90 3253.88 3289.09 3289.19 3362.24 3382.90
frequency: 144.01 149.23 161.01 240.93 282.79 569.25 598.31 759.24 775.63 818.18 949.82 1138.78 1144.16 1148.56 1165.15 1236.87 1402.56 1428.27 1459.03 1486.78 1489.32 1504.15 1512.07 1548.80 2309.53 3132.45 3133.60 3252.90 3253.88 3289.09 3289.19 3362.24 3382.90
formula: C3H8N2
InChI: InChI=1/C3H8N2/c1-4-3-5-2/h4-5H,1-2H3
13 atoms
C  -2.280071 -0.407389 -0.121457
N  -1.178128 0.536285 0.325556
C  -0.009396 0.523678 -0.055239
N  1.158023 0.486416 -0.438413
C  2.293691 -0.293292 0.199619
H  -1.879316 -1.123612 -0.831504
H  -3.050553 0.218105 -0.570183
H  -2.646872 -0.893939 0.781078
H  -1.447465 1.263133 1.011909
H  1.401728 1.048597 -1.272974
H  3.040233 0.444346 0.490706
H  1.919658 -0.846574 1.055109
H  2.678468 -0.955653 -0.574207
totalener: -227.34706178 hartree
nucrepener: 174.21872475 hartree
electener: -401.56578652 hartree
oneelecener: -633.20151545 hartree
twoeener: 231.63572892 hartree
kineticenergy: 225.69612197 hartree
exchangeener: -17.286007971945 hartree
correlationener: -1.632197229143 hartree
xcener: -18.918205201088 hartree
energy: -413.6947 -413.6935 -301.3165 -295.7723 -295.7703 -43.4854 -41.8834 -34.0738 -33.2370 -31.1843 -30.5608 -27.0712 -26.9079 -25.2275 -25.2115 -23.2403 -23.2022 -22.3044 -22.3022 -12.6371 -12.6344 -8.7785 -7.0456 -5.6964 -5.1870 -4.5407 -4.1808 -4.1475 -3.9994 -3.7496 -3.5251 -3.1138 1.8873 1.9467 2.2961 2.7953 3.8215 3.9651 4.7012 5.3407 6.2396 8.2846 8.5210 11.1660 11.3066 11.9180 13.8308 14.8430 16.1729 16.3494 17.2514 18.4452 18.4503 18.6352 18.9057 19.4753 19.5614 22.3447 22.8003 26.1662 27.8119 29.2429 32.1525 32.9139 33.8248 36.4231 37.5451 40.8180 41.4420 41.6787 41.7641 45.6481 46.2647 50.2012 51.0808 51.5111 51.9949 52.3972 53.0606 56.2300 57.4466 57.6923 64.5822 71.8441 71.9325 75.5476 362.0652 362.9643 367.4286 514.2177 515.2870 electronvolt
chargesum: 2.0000000
charge: -0.531954 -0.478448 0.834168 -0.478648 -0.531708 0.331587 0.370290 0.368166 0.523246 0.523143 0.370179 0.331875 0.368103
charge: -0.188733 0.009060 0.377870 0.008984 -0.188748 0.191782 0.211989 0.210821 0.376144 0.376155 0.211948 0.191939 0.210788
qa: -0.5320 -0.4784 0.8342 -0.4786 -0.5317 0.3316 0.3703 0.3682 0.5232 0.5231 0.3702 0.3319 0.3681
va: 3.3109 3.3320 3.6283 3.3321 3.3107 0.8665 0.8388 0.8402 0.7074 0.7075 0.8388 0.8663 0.8402
dispersion: -0.004586389 hartree
energy: -227.332364105074 hartree
dipole: 0.03719 -0.04766 -0.01047 -1.97039 2.49855 0.52816 0.21037 -0.27080 -0.06043
magnitude: 0.53171 au
magnitude: 1.35150 debye
temp: 298.15 k
press: 1.00 atm
zeropoint: 0.11736817 hartree
thermalvibcorrection: 0.00363827 hartree
thermalrotcorrection: 0.00141627 hartree
thermaltrasncorrection: 0.00141627 hartree
thermaltotal: -227.20852512 hartree
thermalcorr: 0.00647081 hartree
nonthermalcorr: 0.11736817 hartree
totalcorr: 0.12383898 hartree
thermalcorrenthalpy: 0.00094421 hartree
totalenthalpy: -227.20758091 hartree
vibrat: 0.00630497 hartree
rotat: 0.01220983 hartree
transl: 0.01840817 hartree
total: 0.03692298 hartree
totalentropycorr: -0.03692298 hartree
gibbsenthalpy: -227.24450389 hartree
gibbsminuselec: 0.08786022 hartree
