program: Orca
programVersion: 5.0.4
elementType: C N C N C H H H H H H H H
charge: 2
multiplicity: 1
keywords: SP DSD-BLYP D3BJ def2-QZVPP def2-QZVPP/C def2/J TightSCF
formula: C3H8N2
InChI: InChI=1/C3H8N2/c1-4-3-5-2/h4-5H,1-2H3
13 atoms
C  -2.277092 -0.56474 -0.10461
N  -1.175149 0.378934 0.342402
C  -0.006416 0.366327 -0.038393
N  1.161003 0.329065 -0.421566
C  2.296671 -0.450643 0.216466
H  -1.876336 -1.280963 -0.814658
H  -3.047573 0.060754 -0.553336
H  -2.643892 -1.05129 0.797924
H  -1.444486 1.105782 1.028755
H  1.404707 0.891246 -1.256128
H  3.043212 0.286995 0.507552
H  1.922638 -1.003925 1.071955
H  2.681448 -1.113004 -0.557361
totalener: -227.21456043 hartree
nucrepener: 174.21872483 hartree
electener: -401.43328526 hartree
oneelecener: -633.42833674 hartree
twoeener: 231.99505148 hartree
kineticenergy: 226.58153973 hartree
exchangeener: -9.647805143005 hartree
correlationener: -0.679293533971 hartree
xcener: -10.327098676976 hartree
chargesum: 2.0000000
charge: 0.009737 -0.078811 0.501367 -0.075955 0.010627 0.133699 0.177560 0.176913 0.329872 0.327684 0.179336 0.133000 0.174972
charge: 0.369217 0.682313 0.056965 0.682227 0.369275 -0.029164 -0.016742 -0.017599 -0.016492 -0.016480 -0.016774 -0.029043 -0.017702
qa: 0.0097 -0.0788 0.5014 -0.0760 0.0106 0.1337 0.1776 0.1769 0.3299 0.3277 0.1793 0.1330 0.1750
va: 3.6061 3.5012 3.8565 3.5012 3.6069 0.9815 0.9715 0.9714 0.9138 0.9148 0.9705 0.9822 0.9718
total: -227.674810051 hartree
dispersion: -0.004588707 hartree
energy: -227.679398757530 hartree
dipole: 0.03719 -0.04700 -0.00982 -1.97039 2.46204 0.49165 0.21037 -0.26626 -0.05588
magnitude: 0.49491 au
magnitude: 1.25796 debye
