program: Orca
programVersion: 5.0.4
elementType: C N C F N C C H H H H H H H H H H
charge: 1
multiplicity: 1
keywords: Freq RIJCOSX PBEh-3c
frequency: 0.00 0.00 0.00 0.00 0.00 0.00 64.09 86.33 108.00 143.96 174.74 219.94 301.02 348.65 397.25 548.92 564.08 600.68 757.18 838.72 994.12 1114.89 1138.82 1150.63 1179.43 1199.59 1213.08 1284.78 1314.95 1483.43 1505.82 1513.76 1530.99 1539.62 1547.52 1548.07 1554.23 1555.32 1578.42 1659.64 1838.96 3122.22 3147.99 3152.88 3206.09 3235.49 3247.13 3257.52 3270.50 3281.77 3701.45
frequency: 64.09 86.33 108.00 143.96 174.74 219.94 301.02 348.65 397.25 548.92 564.08 600.68 757.18 838.72 994.12 1114.89 1138.82 1150.63 1179.43 1199.59 1213.08 1284.78 1314.95 1483.43 1505.82 1513.76 1530.99 1539.62 1547.52 1548.07 1554.23 1555.32 1578.42 1659.64 1838.96 3122.22 3147.99 3152.88 3206.09 3235.49 3247.13 3257.52 3270.50 3281.77 3701.45
formula: C4H10FN2
InChI: InChI=1/C4H10FN2/c1-6-4(5)7(2)3/h6H,1-3H3
17 atoms
C  2.717944 0.238571 -0.278803
N  1.273494 0.483835 -0.291365
C  0.383264 -0.368216 0.152001
F  0.862699 -1.476358 0.630932
N  -0.910929 -0.209323 0.157789
C  -1.838494 -1.227306 0.659112
C  -1.486204 1.026951 -0.365233
H  3.201823 1.126638 -0.670285
H  2.979497 -0.60535 -0.912851
H  3.079833 0.068092 0.732109
H  0.950372 1.357025 -0.677449
H  -2.514578 -1.516464 -0.142902
H  -1.317528 -2.110596 1.009414
H  -2.413244 -0.811201 1.483995
H  -1.266006 1.149451 -1.426484
H  -2.564842 0.979829 -0.256028
H  -1.137001 1.894622 0.19595
totalener: -366.80997779 hartree
nucrepener: 338.81883381 hartree
electener: -705.62881160 hartree
oneelecener: -1159.73444963 hartree
twoeener: 454.10563803 hartree
kineticenergy: 364.19808041 hartree
exchangeener: -26.433316968383 hartree
correlationener: -2.460735792224 hartree
xcener: -28.894052760607 hartree
energy: -689.6730 -405.3778 -405.1107 -294.8055 -290.0125 -289.6755 -289.6509 -43.7355 -35.6393 -33.7935 -27.9106 -27.3632 -25.9964 -24.7807 -22.9588 -21.7737 -21.7348 -19.9243 -19.4345 -19.2257 -18.9825 -18.4782 -17.7610 -17.5673 -17.1273 -16.8256 -15.8784 -13.4663 -4.0715 -1.8722 -1.1794 -0.4268 0.1117 0.3130 0.6741 0.9595 1.2309 1.3818 1.8027 2.0081 2.0629 2.4133 3.2317 4.8912 6.8492 7.1834 7.9993 9.1636 9.3218 9.5633 9.9683 10.5320 10.7876 11.4260 12.5802 13.0158 13.6291 14.8400 18.3734 19.1829 20.1721 20.6029 21.7465 21.9189 22.1601 22.6102 22.7699 23.1750 23.6157 23.8804 24.0232 24.1368 24.7684 25.2108 27.1530 27.3857 28.2507 29.4079 30.0182 30.1835 32.1677 33.4943 33.7549 34.6480 35.2765 36.0618 39.2096 39.8299 40.7347 45.4626 46.2550 47.8918 48.6439 49.2943 49.9582 51.0853 51.1920 51.3293 52.1650 53.1604 53.3388 55.3571 56.6927 57.5399 57.5911 59.4777 60.6240 61.0617 61.2756 64.7050 65.2856 67.2092 67.7049 69.0936 70.9953 76.2597 81.2950 82.6968 367.6737 369.6392 370.8058 377.2816 519.3543 522.7094 888.3028 electronvolt
chargesum: 1.0000000
charge: -0.519606 -0.649333 0.972013 -0.227999 -0.460985 -0.539743 -0.573566 0.278853 0.284962 0.285104 0.429627 0.283801 0.290808 0.284082 0.277015 0.309049 0.275918
charge: -0.242739 -0.173432 0.298780 -0.052421 -0.071829 -0.237043 -0.250047 0.161575 0.157609 0.158374 0.293981 0.157503 0.164149 0.157521 0.152658 0.172887 0.152475
qa: -0.5196 -0.6493 0.9720 -0.2280 -0.4610 -0.5397 -0.5736 0.2789 0.2850 0.2851 0.4296 0.2838 0.2908 0.2841 0.2770 0.3090 0.2759
va: 3.5872 3.1017 3.7030 1.2071 3.2224 3.5739 3.5779 0.8944 0.8836 0.8845 0.7950 0.8826 0.8959 0.8825 0.8852 0.8844 0.8862
dispersion: -0.007425297 hartree
energy: -366.782427382880 hartree
dipole: -3.16835 2.88875 -0.27960 4.95052 -4.02600 0.92453 -2.13098 1.71359 -0.41739
magnitude: 1.05221 au
magnitude: 2.67450 debye
temp: 298.15 k
press: 1.00 atm
zeropoint: 0.15314446 hartree
thermalvibcorrection: 0.00607870 hartree
thermalrotcorrection: 0.00141627 hartree
thermaltrasncorrection: 0.00141627 hartree
thermaltotal: -366.62037168 hartree
thermalcorr: 0.00891124 hartree
nonthermalcorr: 0.15314446 hartree
totalcorr: 0.16205570 hartree
thermalcorrenthalpy: 0.00094421 hartree
totalenthalpy: -366.61942747 hartree
vibrat: 0.01087413 hartree
rotat: 0.01314093 hartree
transl: 0.01894218 hartree
total: 0.04295724 hartree
totalentropycorr: -0.04295724 hartree
gibbsenthalpy: -366.66238471 hartree
gibbsminuselec: 0.12004268 hartree
