program: Orca
programVersion: 5.0.4
elementType: C N C F N C C H H H H H H H H H H
charge: 1
multiplicity: 1
keywords: Opt RIJCOSX PBEh-3c
formula: C4H10FN2
InChI: InChI=1/C4H10FN2/c1-6-4(5)7(2)3/h6H,1-3H3
17 atoms
C  2.717944 0.238571 -0.278803
N  1.273494 0.483835 -0.291365
C  0.383264 -0.368216 0.152001
F  0.862699 -1.476358 0.630932
N  -0.910929 -0.209323 0.157789
C  -1.838494 -1.227306 0.659112
C  -1.486204 1.026951 -0.365233
H  3.201823 1.126638 -0.670285
H  2.979497 -0.60535 -0.912851
H  3.079833 0.068092 0.732109
H  0.950372 1.357025 -0.677449
H  -2.514578 -1.516464 -0.142902
H  -1.317528 -2.110596 1.009414
H  -2.413244 -0.811201 1.483995
H  -1.266006 1.149451 -1.426484
H  -2.564842 0.979829 -0.256028
H  -1.137001 1.894622 0.19595
totalener: -366.80983833 hartree
nucrepener: 338.71399249 hartree
electener: -705.52383082 hartree
oneelecener: -1159.52313767 hartree
twoeener: 453.99930685 hartree
kineticenergy: 364.19885398 hartree
exchangeener: -26.433239181101 hartree
correlationener: -2.460756884305 hartree
xcener: -28.893996065406 hartree
dispersion: -0.007423683 hartree
dispersion: -0.007423062 hartree
dispersion: -0.007421937 hartree
dispersion: -0.007421993 hartree
dispersion: -0.007422840 hartree
dispersion: -0.007423862 hartree
dispersion: -0.007424461 hartree
dispersion: -0.007424606 hartree
dispersion: -0.007424532 hartree
dispersion: -0.007424467 hartree
dispersion: -0.007424492 hartree
dispersion: -0.007424672 hartree
dispersion: -0.007424992 hartree
dispersion: -0.007425269 hartree
dispersion: -0.007425328 hartree
energy: -689.6746 -405.3770 -405.1112 -294.8057 -290.0123 -289.6755 -289.6512 -43.7361 -35.6392 -33.7936 -27.9106 -27.3631 -25.9965 -24.7811 -22.9591 -21.7737 -21.7352 -19.9245 -19.4345 -19.2260 -18.9825 -18.4784 -17.7609 -17.5672 -17.1274 -16.8255 -15.8785 -13.4663 -4.0716 -1.8722 -1.1795 -0.4267 0.1117 0.3130 0.6741 0.9595 1.2309 1.3817 1.8027 2.0081 2.0628 2.4134 3.2316 4.8912 6.8492 7.1833 7.9992 9.1636 9.3217 9.5632 9.9683 10.5320 10.7875 11.4260 12.5802 13.0159 13.6290 14.8401 18.3733 19.1827 20.1722 20.6031 21.7465 21.9190 22.1600 22.6101 22.7699 23.1750 23.6158 23.8803 24.0232 24.1367 24.7684 25.2108 27.1528 27.3855 28.2506 29.4078 30.0178 30.1833 32.1677 33.4942 33.7549 34.6481 35.2764 36.0615 39.2094 39.8300 40.7345 45.4626 46.2550 47.8917 48.6439 49.2944 49.9583 51.0854 51.1920 51.3293 52.1649 53.1602 53.3388 55.3570 56.6926 57.5400 57.5912 59.4777 60.6239 61.0617 61.2756 64.7049 65.2856 67.2093 67.7049 69.0936 70.9954 76.2592 81.2949 82.6968 367.6738 369.6390 370.8059 377.2814 519.3542 522.7098 888.3013 electronvolt
chargesum: 1.0000000
charge: -0.519597 -0.649316 0.972016 -0.227977 -0.461025 -0.539733 -0.573566 0.278849 0.284956 0.285101 0.429620 0.283796 0.290809 0.284081 0.277014 0.309049 0.275923
charge: -0.242734 -0.173416 0.298778 -0.052400 -0.071858 -0.237037 -0.250049 0.161572 0.157605 0.158372 0.293976 0.157500 0.164150 0.157521 0.152658 0.172887 0.152477
qa: -0.5196 -0.6493 0.9720 -0.2280 -0.4610 -0.5397 -0.5736 0.2788 0.2850 0.2851 0.4296 0.2838 0.2908 0.2841 0.2770 0.3090 0.2759
va: 3.5872 3.1017 3.7030 1.2071 3.2224 3.5739 3.5779 0.8944 0.8836 0.8845 0.7950 0.8826 0.8959 0.8825 0.8852 0.8844 0.8862
dispersion: -0.007425297 hartree
energy: -366.782427386677 hartree
dipole: -3.16835 2.88884 -0.27951 4.95052 -4.02602 0.92450 -2.13098 1.71365 -0.41733
magnitude: 1.05214 au
magnitude: 2.67433 debye
